{"text_format":"1","workbook":"xlsx","n_sheets":4,"sheets":["Accueil","Evaluation","Barèmes & Options","Présentation des profils"],"not_rendered":{"charts":0,"images":1,"macros":1,"external_links":0,"defined_names":395,"comments":1,"pivot_tables":0},"unopened":[],"bounds":{"document_bytes":16777216,"sheet_cells":100000,"rows_first":2000,"rows_last":500,"rows_between":2000,"halvings":0,"cell_chars":16384,"cell_head_chars":4096},"cells_cut":0,"cells_raw":0,"read":"whole","date_system":"1900"}

{"sheet":"Accueil","index":0,"n_rows":0,"n_cols":0,"rows_kept":0,"cut":false,"hidden":false,"merged":[]}

{"sheet":"Evaluation","index":1,"n_rows":101,"n_cols":39,"rows_kept":101,"cut":false,"hidden":false,"merged":[[0,0,0,30]]}
["Course de demi-fond CAP-BEP  N3 - 2018"]
[]
["Nom","Prénom","Sexe F ou M","Classe","Profil choisi","500-1","Profil si régulation","500-2","500-2","Points echauffement","Temps Total","profil choisi","500-1","500-2","500-3","c2-c1","c3-c2","c3-c1","respect c1-c2=","respect c1-c2+","respect c1-c2-","respect C2-C3=","respect C2-C3+","respect C2-C3-","Respect Profile 9","points respect","Respect C1","Respect C2","points profil","Points perf","Note",null,null,null,null,null,"Sexe"]
[null,null,null,null,null,null,null,null,null,null,{"$f":"IF(AND(O4<>\"\",N4<>\"\",M4<>\"\"),(INT(((INT($M4)*60)+(($M4-INT($M4))*100)+(INT($N4)*60)+(($N4-INT($N4))*100)+(INT($O4)*60)+(($O4-INT($O4))*100))/60)+MOD(((INT($M4)*60)+(($M4-INT($M4))*100)+(INT($N4)*60)+(($N4-INT($N4))*100)+(INT($O4)*60)+(($O4-INT($O4))*100)),60)/100)*100,\"\")","v":""},{"$f":"IF(AND(E4=\"\",G4=\"\"),\"\",IF(G4=\"\",E4,G4))","v":""},{"$f":"IF(F4<>\"\",INT(F4/100)+((F4/100-INT(F4/100))),\"\")","v":""},{"$f":"IF(H4<>\"\",INT(H4/100)+((H4/100-INT(H4/100))),\"\")","v":""},{"$f":"IF(I4<>\"\",INT(I4/100)+((I4/100-INT(I4/100))),\"\")","v":""},{"$f":"ROUND((INT(N4)*60)+((N4-INT(N4))*100)-((INT(M4)*60)+((M4-INT(M4))*100)),0)","v":{"$error":"#VALUE!"}},{"$f":"ROUND((INT(O4)*60)+((O4-INT(O4))*100)-((INT(N4)*60)+((N4-INT(N4))*100)),0)","v":{"$error":"#VALUE!"}},{"$f":"ROUND((INT(O4)*60)+((O4-INT(O4))*100)-((INT(M4)*60)+((M4-INT(M4))*100)),0)","v":{"$error":"#VALUE!"}},{"$f":"IF(AND(N4<>\"\",M4<>\"\"),IF(OR(L4=1,L4=3,L4=4),IF(ABS(P4)<=3.5,1,0)),\"\")","v":""},{"$f":"IF(AND(N4<>\"\",M4<>\"\"),IF(OR(L4=5,L4=7),IF(P4>0,1,0)),\"\")","v":""},{"$f":"IF(AND(N4<>\"\",M4<>\"\"),IF(OR(L4=2,L4=6,L4=8),IF(P4<0,1,0)),\"\")","v":""},{"$f":"IF(AND(N4<>\"\",O4<>\"\"),IF(OR(L4=1,L4=5,L4=6),IF(ABS(Q4)<=3.5,1,0)),\"\")","v":""},{"$f":"IF(AND(N4<>\"\",O4<>\"\"),IF(OR(L4=4,L4=8),IF(Q4>0,1,0)),\"\")","v":""},{"$f":"IF(AND(N4<>\"\",O4<>\"\"),IF(OR(L4=2,L4=3,L4=7),IF(Q4<0,1,0)),\"\")","v":""},{"$f":"IF(SUM(S4:X4)=2,IF(L4=2,IF(L4=2,IF(R4-'Barèmes & Options'!H$2<-1,0,1)),\"\"),0)","v":0},{"$f":"IF(OR(L4=2,L4=9),SUM(S4:X4)-Y4,SUM(S4:X4))","v":0},{"$f":"IF(OR(S4=1,T4=1,U4=1),TRUE,FALSE)","v":false},{"$f":"IF(OR(V4=1,W4=1,X4=1),TRUE,FALSE)","v":false},{"$f":"IF(L4<>\"\",IF(AND(L4>=1,L4<=8,L4=ABS(L4)),IF(AND(L4<=9,L4>=1),IF(AND(Z4=1,G4<>\"\"),1,IF(AND(Z4=1,G4=\"\"),1.5,IF(AND(Z4=2,G4<>\"\"),2,IF(AND(Z4=2,G4=\"\"),3,0)))),\"\"),\"Err. Profil\"),\"\")","v":""},{"$f":"IF(AND(O4<>\"\",N4<>\"\",M4<>\"\"),IF($C4=\"\",\"\",IF($C4=\"F\",VLOOKUP(ROUND($K4,0)/100,BARF,2),VLOOKUP(ROUND($K4,0)/100,BARG,2))),\"\")","v":""},{"$f":"IF(OR(J4=\"\",AD4=\"\",AC4=\"\"),\"\",IF(OR(J4<0,J4>3),\"Err ech.\",SUM(J4,AD4,AC4)))","v":""},null,"Moyenne F. :",{"$f":"IF(ISERROR(AL4),\"\",AL4)","v":""},null,null,{"$f":"IF(C4<>\"f\",\"m\",\"f\")","v":"m"},{"$f":"AVERAGEIF(AK4:AK101,\"f\",AE4:AE101)","v":{"$error":"#DIV/0!"}},"filles"]
[null,null,null,null,null,null,null,null,null,null,"","","","","",{"$error":"#VALUE!"},{"$error":"#VALUE!"},{"$error":"#VALUE!"},"","","","","","",{"$f":"IF(SUM(S5:X5)=2,IF(L5=2,IF(L5=2,IF(R5-'Barèmes & Options'!H$2<-1,0,1)),\"\"),0)","v":0},0,false,false,{"$f":"IF(L5<>\"\",IF(AND(L5>=1,L5<=8,L5=ABS(L5)),IF(AND(L5<=9,L5>=1),IF(AND(Z5=1,G5<>\"\"),1,IF(AND(Z5=1,G5=\"\"),1.5,IF(AND(Z5=2,G5<>\"\"),2,IF(AND(Z5=2,G5=\"\"),3,0)))),\"\"),\"Err. Profil\"),\"\")","v":""},"","",null,"moyenne G. :",{"$f":"IF(ISERROR(AL5),\"\",AL5)","v":""},null,null,"m",{"$f":"AVERAGEIF(AK4:AK101,\"m\",AE4:AE101)","v":{"$error":"#DIV/0!"}},"garçons"]
[null,null,null,null,null,null,null,null,null,null,"","","","","",{"$error":"#VALUE!"},{"$error":"#VALUE!"},{"$error":"#VALUE!"},"","","","","","",{"$f":"IF(SUM(S6:X6)=2,IF(L6=2,IF(L6=2,IF(R6-'Barèmes & Options'!H$2<-1,0,1)),\"\"),0)","v":0},0,false,false,"","","",null,"Moyenne :",{"$f":"IF(ISERROR(AL6),\"\",AL6)","v":""},null,null,"m",{"$f":"AVERAGE(AE4:AE101)","v":{"$error":"#DIV/0!"}},"géné"]
[null,null,null,null,null,null,null,null,null,null,"","","","","",{"$error":"#VALUE!"},{"$error":"#VALUE!"},{"$error":"#VALUE!"},"","","","","","",{"$f":"IF(SUM(S7:X7)=2,IF(L7=2,IF(L7=2,IF(R7-'Barèmes & Options'!H$2<-1,0,1)),\"\"),0)","v":0},0,false,false,"","","",null,"Note max :",{"$f":"IF(COUNT(AE4:AE101)>0,MAX(AE4:AE101),\"\")","v":""},null,null,"m"]
[null,null,null,null,null,null,null,null,null,null,"","","","","",{"$error":"#VALUE!"},{"$error":"#VALUE!"},{"$error":"#VALUE!"},"","","","","","",{"$f":"IF(SUM(S8:X8)=2,IF(L8=2,IF(L8=2,IF(R8-'Barèmes & Options'!H$2<-1,0,1)),\"\"),0)","v":0},0,false,false,"","","",null,"Note min :",{"$f":"IF(COUNT(AE4:AE101)>0,MIN(AE4:AE101),\"\")","v":""},null,null,"m"]
[null,null,null,null,null,null,null,null,null,null,"","","","","",{"$error":"#VALUE!"},{"$error":"#VALUE!"},{"$error":"#VALUE!"},"","","","","","",{"$f":"IF(SUM(S9:X9)=2,IF(L9=2,IF(L9=2,IF(R9-'Barèmes & Options'!H$2<-1,0,1)),\"\"),0)","v":0},0,false,false,"","","",null,null,null,null,null,"m"]
[null,null,null,null,null,null,null,null,null,null,"","","","","",{"$error":"#VALUE!"},{"$error":"#VALUE!"},{"$error":"#VALUE!"},"","","","","","",{"$f":"IF(SUM(S10:X10)=2,IF(L10=2,IF(L10=2,IF(R10-'Barèmes & Options'!H$2<-1,0,1)),\"\"),0)","v":0},0,false,false,"","","",null,"Date :",null,null,null,"m"]
[null,null,null,null,null,null,null,null,null,null,"","","","","",{"$error":"#VALUE!"},{"$error":"#VALUE!"},{"$error":"#VALUE!"},"","","","","","",{"$f":"IF(SUM(S11:X11)=2,IF(L11=2,IF(L11=2,IF(R11-'Barèmes & Options'!H$2<-1,0,1)),\"\"),0)","v":0},0,false,false,"","","",null,null,null,null,null,"m"]
[null,null,null,null,null,null,null,null,null,null,"","","","","",{"$error":"#VALUE!"},{"$error":"#VALUE!"},{"$error":"#VALUE!"},"","","","","","",{"$f":"IF(SUM(S12:X12)=2,IF(L12=2,IF(L12=2,IF(R12-'Barèmes & Options'!H$2<-1,0,1)),\"\"),0)","v":0},0,false,false,"","","",null,null,null,null,null,"m"]
[null,null,null,null,null,null,null,null,null,null,"","","","","",{"$error":"#VALUE!"},{"$error":"#VALUE!"},{"$error":"#VALUE!"},"","","","","","",{"$f":"IF(SUM(S13:X13)=2,IF(L13=2,IF(L13=2,IF(R13-'Barèmes & Options'!H$2<-1,0,1)),\"\"),0)","v":0},0,false,false,"","","",null,null,null,null,null,"m"]
[null,null,null,null,null,null,null,null,null,null,"","","","","",{"$error":"#VALUE!"},{"$error":"#VALUE!"},{"$error":"#VALUE!"},"","","","","","",{"$f":"IF(SUM(S14:X14)=2,IF(L14=2,IF(L14=2,IF(R14-'Barèmes & Options'!H$2<-1,0,1)),\"\"),0)","v":0},0,false,false,"","","",null,null,null,null,null,"m"]
[null,null,null,null,null,null,null,null,null,null,"","","","","",{"$error":"#VALUE!"},{"$error":"#VALUE!"},{"$error":"#VALUE!"},"","","","","","",{"$f":"IF(SUM(S15:X15)=2,IF(L15=2,IF(L15=2,IF(R15-'Barèmes & Options'!H$2<-1,0,1)),\"\"),0)","v":0},0,false,false,"","","",null,null,null,null,null,"m"]
[null,null,null,null,null,null,null,null,null,null,"","","","","",{"$error":"#VALUE!"},{"$error":"#VALUE!"},{"$error":"#VALUE!"},"","","","","","",{"$f":"IF(SUM(S16:X16)=2,IF(L16=2,IF(L16=2,IF(R16-'Barèmes & Options'!H$2<-1,0,1)),\"\"),0)","v":0},0,false,false,"","","",null,null,null,null,null,"m"]
[null,null,null,null,null,null,null,null,null,null,"","","","","",{"$error":"#VALUE!"},{"$error":"#VALUE!"},{"$error":"#VALUE!"},"","","","","","",{"$f":"IF(SUM(S17:X17)=2,IF(L17=2,IF(L17=2,IF(R17-'Barèmes & Options'!H$2<-1,0,1)),\"\"),0)","v":0},0,false,false,"","","",null,null,null,null,null,"m"]
[null,null,null,null,null,null,null,null,null,null,"","","","","",{"$error":"#VALUE!"},{"$error":"#VALUE!"},{"$error":"#VALUE!"},"","","","","","",{"$f":"IF(SUM(S18:X18)=2,IF(L18=2,IF(L18=2,IF(R18-'Barèmes & Options'!H$2<-1,0,1)),\"\"),0)","v":0},0,false,false,"","","",null,null,null,null,null,"m"]
[null,null,null,null,null,null,null,null,null,null,"","","","","",{"$error":"#VALUE!"},{"$error":"#VALUE!"},{"$error":"#VALUE!"},"","","","","","",{"$f":"IF(SUM(S19:X19)=2,IF(L19=2,IF(L19=2,IF(R19-'Barèmes & Options'!H$2<-1,0,1)),\"\"),0)","v":0},0,false,false,"","","",null,null,null,null,null,"m"]
[null,null,null,null,null,null,null,null,null,null,"","","","","",{"$error":"#VALUE!"},{"$error":"#VALUE!"},{"$error":"#VALUE!"},"","","","","","",{"$f":"IF(SUM(S20:X20)=2,IF(L20=2,IF(L20=2,IF(R20-'Barèmes & Options'!H$2<-1,0,1)),\"\"),0)","v":0},0,false,false,"","","",null,null,null,null,null,"m"]
[null,null,null,null,null,null,null,null,null,null,"","","","","",{"$error":"#VALUE!"},{"$error":"#VALUE!"},{"$error":"#VALUE!"},"","","","","","",{"$f":"IF(SUM(S21:X21)=2,IF(L21=2,IF(L21=2,IF(R21-'Barèmes & Options'!H$2<-1,0,1)),\"\"),0)","v":0},0,false,false,"","","",null,null,null,null,null,"m"]
[null,null,null,null,null,null,null,null,null,null,"","","","","",{"$error":"#VALUE!"},{"$error":"#VALUE!"},{"$error":"#VALUE!"},"","","","","","",{"$f":"IF(SUM(S22:X22)=2,IF(L22=2,IF(L22=2,IF(R22-'Barèmes & Options'!H$2<-1,0,1)),\"\"),0)","v":0},0,false,false,"","","",null,null,null,null,null,"m"]
[null,null,null,null,null,null,null,null,null,null,"","","","","",{"$error":"#VALUE!"},{"$error":"#VALUE!"},{"$error":"#VALUE!"},"","","","","","",{"$f":"IF(SUM(S23:X23)=2,IF(L23=2,IF(L23=2,IF(R23-'Barèmes & Options'!H$2<-1,0,1)),\"\"),0)","v":0},0,false,false,"","","",null,null,null,null,null,"m"]
[null,null,null,null,null,null,null,null,null,null,"","","","","",{"$error":"#VALUE!"},{"$error":"#VALUE!"},{"$error":"#VALUE!"},"","","","","","",{"$f":"IF(SUM(S24:X24)=2,IF(L24=2,IF(L24=2,IF(R24-'Barèmes & Options'!H$2<-1,0,1)),\"\"),0)","v":0},0,false,false,"","","",null,null,null,null,null,"m"]
[null,null,null,null,null,null,null,null,null,null,"","","","","",{"$error":"#VALUE!"},{"$error":"#VALUE!"},{"$error":"#VALUE!"},"","","","","","",{"$f":"IF(SUM(S25:X25)=2,IF(L25=2,IF(L25=2,IF(R25-'Barèmes & Options'!H$2<-1,0,1)),\"\"),0)","v":0},0,false,false,"","","",null,null,null,null,null,"m"]
[null,null,null,null,null,null,null,null,null,null,"","","","","",{"$error":"#VALUE!"},{"$error":"#VALUE!"},{"$error":"#VALUE!"},"","","","","","",{"$f":"IF(SUM(S26:X26)=2,IF(L26=2,IF(L26=2,IF(R26-'Barèmes & Options'!H$2<-1,0,1)),\"\"),0)","v":0},0,false,false,"","","",null,null,null,null,null,"m"]
[null,null,null,null,null,null,null,null,null,null,"","","","","",{"$error":"#VALUE!"},{"$error":"#VALUE!"},{"$error":"#VALUE!"},"","","","","","",{"$f":"IF(SUM(S27:X27)=2,IF(L27=2,IF(L27=2,IF(R27-'Barèmes & Options'!H$2<-1,0,1)),\"\"),0)","v":0},0,false,false,"","","",null,null,null,null,null,"m"]
[null,null,null,null,null,null,null,null,null,null,"","","","","",{"$error":"#VALUE!"},{"$error":"#VALUE!"},{"$error":"#VALUE!"},"","","","","","",{"$f":"IF(SUM(S28:X28)=2,IF(L28=2,IF(L28=2,IF(R28-'Barèmes & Options'!H$2<-1,0,1)),\"\"),0)","v":0},0,false,false,"","","",null,null,null,null,null,"m"]
[null,null,null,null,null,null,null,null,null,null,"","","","","",{"$error":"#VALUE!"},{"$error":"#VALUE!"},{"$error":"#VALUE!"},"","","","","","",{"$f":"IF(SUM(S29:X29)=2,IF(L29=2,IF(L29=2,IF(R29-'Barèmes & Options'!H$2<-1,0,1)),\"\"),0)","v":0},0,false,false,"","","",null,null,null,null,null,"m"]
[null,null,null,null,null,null,null,null,null,null,"","","","","",{"$error":"#VALUE!"},{"$error":"#VALUE!"},{"$error":"#VALUE!"},"","","","","","",{"$f":"IF(SUM(S30:X30)=2,IF(L30=2,IF(L30=2,IF(R30-'Barèmes & Options'!H$2<-1,0,1)),\"\"),0)","v":0},0,false,false,"","","",null,null,null,null,null,"m"]
[null,null,null,null,null,null,null,null,null,null,"","","","","",{"$error":"#VALUE!"},{"$error":"#VALUE!"},{"$error":"#VALUE!"},"","","","","","",{"$f":"IF(SUM(S31:X31)=2,IF(L31=2,IF(L31=2,IF(R31-'Barèmes & Options'!H$2<-1,0,1)),\"\"),0)","v":0},0,false,false,"","","",null,null,null,null,null,"m"]
[null,null,null,null,null,null,null,null,null,null,"","","","","",{"$error":"#VALUE!"},{"$error":"#VALUE!"},{"$error":"#VALUE!"},"","","","","","",{"$f":"IF(SUM(S32:X32)=2,IF(L32=2,IF(L32=2,IF(R32-'Barèmes & Options'!H$2<-1,0,1)),\"\"),0)","v":0},0,false,false,"","","",null,null,null,null,null,"m"]
[null,null,null,null,null,null,null,null,null,null,"","","","","",{"$error":"#VALUE!"},{"$error":"#VALUE!"},{"$error":"#VALUE!"},"","","","","","",{"$f":"IF(SUM(S33:X33)=2,IF(L33=2,IF(L33=2,IF(R33-'Barèmes & Options'!H$2<-1,0,1)),\"\"),0)","v":0},0,false,false,"","","",null,null,null,null,null,"m"]
[null,null,null,null,null,null,null,null,null,null,"","","","","",{"$error":"#VALUE!"},{"$error":"#VALUE!"},{"$error":"#VALUE!"},"","","","","","",{"$f":"IF(SUM(S34:X34)=2,IF(L34=2,IF(L34=2,IF(R34-'Barèmes & Options'!H$2<-1,0,1)),\"\"),0)","v":0},0,false,false,"","","",null,null,null,null,null,"m"]
[null,null,null,null,null,null,null,null,null,null,"","","","","",{"$error":"#VALUE!"},{"$error":"#VALUE!"},{"$error":"#VALUE!"},"","","","","","",{"$f":"IF(SUM(S35:X35)=2,IF(L35=2,IF(L35=2,IF(R35-'Barèmes & Options'!H$2<-1,0,1)),\"\"),0)","v":0},0,false,false,"","","",null,null,null,null,null,"m"]
[null,null,null,null,null,null,null,null,null,null,{"$f":"IF(AND(O36<>\"\",N36<>\"\",M36<>\"\"),(INT(((INT($M36)*60)+(($M36-INT($M36))*100)+(INT($N36)*60)+(($N36-INT($N36))*100)+(INT($O36)*60)+(($O36-INT($O36))*100))/60)+MOD(((INT($M36)*60)+(($M36-INT($M36))*100)+(INT($N36)*60)+(($N36-INT($N36))*100)+(INT($O36)*60)+(($O36-INT($O36))*100)),60)/100)*100,\"\")","v":""},{"$f":"IF(AND(E36=\"\",G36=\"\"),\"\",IF(G36=\"\",E36,G36))","v":""},{"$f":"IF(F36<>\"\",INT(F36/100)+((F36/100-INT(F36/100))),\"\")","v":""},{"$f":"IF(H36<>\"\",INT(H36/100)+((H36/100-INT(H36/100))),\"\")","v":""},{"$f":"IF(I36<>\"\",INT(I36/100)+((I36/100-INT(I36/100))),\"\")","v":""},{"$f":"ROUND((INT(N36)*60)+((N36-INT(N36))*100)-((INT(M36)*60)+((M36-INT(M36))*100)),0)","v":{"$error":"#VALUE!"}},{"$f":"ROUND((INT(O36)*60)+((O36-INT(O36))*100)-((INT(N36)*60)+((N36-INT(N36))*100)),0)","v":{"$error":"#VALUE!"}},{"$f":"ROUND((INT(O36)*60)+((O36-INT(O36))*100)-((INT(M36)*60)+((M36-INT(M36))*100)),0)","v":{"$error":"#VALUE!"}},{"$f":"IF(AND(N36<>\"\",M36<>\"\"),IF(OR(L36=1,L36=3,L36=4),IF(ABS(P36)<=3.5,1,0)),\"\")","v":""},{"$f":"IF(AND(N36<>\"\",M36<>\"\"),IF(OR(L36=5,L36=7),IF(P36>0,1,0)),\"\")","v":""},{"$f":"IF(AND(N36<>\"\",M36<>\"\"),IF(OR(L36=2,L36=6,L36=8),IF(P36<0,1,0)),\"\")","v":""},{"$f":"IF(AND(N36<>\"\",O36<>\"\"),IF(OR(L36=1,L36=5,L36=6),IF(ABS(Q36)<=3.5,1,0)),\"\")","v":""},{"$f":"IF(AND(N36<>\"\",O36<>\"\"),IF(OR(L36=4,L36=8),IF(Q36>0,1,0)),\"\")","v":""},{"$f":"IF(AND(N36<>\"\",O36<>\"\"),IF(OR(L36=2,L36=3,L36=7),IF(Q36<0,1,0)),\"\")","v":""},{"$f":"IF(SUM(S36:X36)=2,IF(L36=2,IF(L36=2,IF(R36-'Barèmes & Options'!H$2<-1,0,1)),\"\"),0)","v":0},{"$f":"IF(OR(L36=2,L36=9),SUM(S36:X36)-Y36,SUM(S36:X36))","v":0},false,false,"",{"$f":"IF(AND(O36<>\"\",N36<>\"\",M36<>\"\"),IF($C36=\"\",\"\",IF($C36=\"F\",VLOOKUP(ROUND($K36,0)/100,BARF,2),VLOOKUP(ROUND($K36,0)/100,BARG,2))),\"\")","v":""},{"$f":"IF(OR(J36=\"\",AD36=\"\",AC36=\"\"),\"\",IF(OR(J36<0,J36>3),\"Err ech.\",SUM(J36,AD36,AC36)))","v":""},null,null,null,null,null,{"$f":"IF(C36<>\"f\",\"m\",\"f\")","v":"m"}]
[null,null,null,null,null,null,null,null,null,null,"","","","","",{"$error":"#VALUE!"},{"$error":"#VALUE!"},{"$error":"#VALUE!"},"","","","","","",{"$f":"IF(SUM(S37:X37)=2,IF(L37=2,IF(L37=2,IF(R37-'Barèmes & Options'!H$2<-1,0,1)),\"\"),0)","v":0},0,false,false,"","","",null,null,null,null,null,"m"]
[null,null,null,null,null,null,null,null,null,null,"","","","","",{"$error":"#VALUE!"},{"$error":"#VALUE!"},{"$error":"#VALUE!"},"","","","","","",{"$f":"IF(SUM(S38:X38)=2,IF(L38=2,IF(L38=2,IF(R38-'Barèmes & Options'!H$2<-1,0,1)),\"\"),0)","v":0},0,false,false,"","","",null,null,null,null,null,"m"]
[null,null,null,null,null,null,null,null,null,null,"","","","","",{"$error":"#VALUE!"},{"$error":"#VALUE!"},{"$error":"#VALUE!"},"","","","","","",{"$f":"IF(SUM(S39:X39)=2,IF(L39=2,IF(L39=2,IF(R39-'Barèmes & Options'!H$2<-1,0,1)),\"\"),0)","v":0},0,false,false,"","","",null,null,null,null,null,"m"]
[null,null,null,null,null,null,null,null,null,null,"","","","","",{"$error":"#VALUE!"},{"$error":"#VALUE!"},{"$error":"#VALUE!"},"","","","","","",{"$f":"IF(SUM(S40:X40)=2,IF(L40=2,IF(L40=2,IF(R40-'Barèmes & Options'!H$2<-1,0,1)),\"\"),0)","v":0},0,false,false,"","","",null,null,null,null,null,"m"]
{"$rows_left_out":62}
{"sheet":"Barèmes & Options","index":2,"n_rows":141,"n_cols":13,"rows_kept":141,"cut":false,"hidden":false,"merged":[[0,0,0,2],[0,9,0,10],[0,11,0,12]]}
[null,null,null,null,null,null,null,null,null,"Barème Garçons",null,"Barème Filles"]
[null,null,null,null,null,null,null,null,null,"TPS G","Pts G","TPS F","PTS F"]
[null,null,null,null,null,null,null,null,null,3,14,3.3,14]
[null,null,null,null,null,null,null,null,null,4.4800000000000004,14,6.11,14]
[null,null,null,null,null,null,null,null,null,4.49,13.9,6.12,13.9]
[null,null,null,null,null,null,null,null,null,4.5,13.8,6.13,13.8]
[null,null,null,null,null,null,null,null,null,4.51,13.7,6.14,13.7]
[null,null,null,null,null,null,null,null,null,4.51,13.6,6.15,13.6]
[null,null,null,null,null,null,null,null,null,4.5199999999999996,13.5,6.16,13.5]
[null,null,null,null,null,null,null,null,null,4.53,13.4,6.17,13.4]
[null,null,null,null,null,null,null,null,null,4.54,13.3,6.18,13.3]
[null,null,null,null,null,null,null,null,null,4.55,13.2,6.19,13.2]
[null,null,null,null,null,null,null,null,null,4.55,13.1,6.2,13.1]
[null,null,null,null,null,null,null,null,null,4.5599999999999996,13,6.21,13]
[null,null,null,null,null,null,null,null,null,4.57,12.9,6.22,12.9]
[null,null,null,null,null,null,null,null,null,4.58,12.8,6.23,12.8]
[null,null,null,null,null,null,null,null,null,4.59,12.7,6.24,12.7]
[null,null,null,null,null,null,null,null,null,5,12.6,6.25,12.6]
[null,null,null,null,null,null,null,null,null,5.01,12.5,6.26,12.5]
[null,null,null,null,null,null,null,null,null,5.0199999999999996,12.4,6.27,12.4]
[null,null,null,null,null,null,null,null,null,5.03,12.3,6.28,12.3]
[null,null,null,null,null,null,null,null,null,5.04,12.2,6.29,12.2]
[null,null,null,null,null,null,null,null,null,5.04,12.1,6.3,12.1]
[null,null,null,null,null,null,null,null,null,5.05,12,6.31,12]
[null,null,null,null,null,null,null,null,null,5.0599999999999996,11.9,6.32,11.9]
[null,null,null,null,null,null,null,null,null,5.07,11.8,6.33,11.8]
[null,null,null,null,null,null,null,null,null,5.08,11.7,6.34,11.7]
[null,null,null,null,null,null,null,null,null,5.08,11.6,6.35,11.6]
[null,null,null,null,null,null,null,null,null,5.09,11.5,6.37,11.5]
[null,null,null,null,null,null,null,null,null,5.0999999999999996,11.4,6.38,11.4]
[null,null,null,null,null,null,null,null,null,5.1100000000000003,11.3,6.39,11.3]
[null,null,null,null,null,null,null,null,null,5.12,11.2,6.4,11.2]
[null,null,null,null,null,null,null,null,null,5.12,11.1,6.41,11.1]
[null,null,null,null,null,null,null,null,null,5.13,11,6.42,11]
[null,null,null,null,null,null,null,null,null,5.14,10.9,6.43,10.9]
[null,null,null,null,null,null,null,null,null,5.15,10.8,6.44,10.8]
[null,null,null,null,null,null,null,null,null,5.16,10.7,6.45,10.7]
[null,null,null,null,null,null,null,null,null,5.16,10.6,6.46,10.6]
[null,null,null,null,null,null,null,null,null,5.17,10.5,6.47,10.5]
[null,null,null,null,null,null,null,null,null,5.19,10.4,6.49,10.4]
{"$rows_left_out":102}
{"sheet":"Présentation des profils","index":3,"n_rows":0,"n_cols":0,"rows_kept":0,"cut":false,"hidden":false,"merged":[]}