{"text_format":"1","workbook":"xlsx","n_sheets":36,"sheets":["MENU","Circuits","Liste classe","Synthèse","Présentation","E1","E2","E3","E4","E5","E6","E7","E8","E9","E10","E11","E12","E13","E14","E15","E16","E17","E18","E19","E20","E21","E22","E23","E24","E25","E26","E27","E28","E29","E30","Espace Prof"],"not_rendered":{"charts":0,"images":4,"macros":1,"external_links":0,"defined_names":2,"comments":0,"pivot_tables":0},"unopened":[],"bounds":{"document_bytes":16777216,"sheet_cells":100000,"rows_first":2000,"rows_last":500,"rows_between":2000,"halvings":0,"cell_chars":16384,"cell_head_chars":4096},"cells_cut":0,"cells_raw":0,"read":"whole","date_system":"1900"}

{"sheet":"MENU","index":0,"n_rows":33,"n_cols":11,"rows_kept":33,"cut":false,"hidden":false,"merged":[[1,8,2,8],[1,10,2,10],[1,1,2,1],[1,2,2,2],[1,3,2,3],[1,4,2,4],[1,5,2,5],[1,6,2,6],[1,7,2,7]]}
[]
[null,"Equipe","Temps dernier circuit","Prochain circuit","Statut de course","Nb circuits réalisés","Circuit en cours","Noms","Heure Départ",null,"Durée (clic F9)"]
[]
[null,"E1",{"$f":"IF(OR(F4=0,E4=\"En Course\"),\"\",VLOOKUP(MAX('E1'!$E$3:$E$22),'E1'!$E$3:$F$22,2,FALSE))","v":""},{"$f":"IF(OR(F4=0,E4=\"Arrivée\"),INDEX('E1'!$B$3:$B$22,MATCH(TRUE,ISBLANK('E1'!$D$3:$D$22),0),1),\"\")","v":" "},{"$f":"IF('E1'!D30='E1'!E30,\"Arrivée\",\"En Course\")","v":"Arrivée"},{"$f":"'E1'!D30","v":0},{"$f":"IF(ISBLANK('E1'!$Q$23),\"\",'E1'!$Q$23)","v":""},{"$f":"Synthèse!B5","v":"     "},{"$f":"IF(OR(F4=0,E4=\"Arrivée\"),\"\",INDEX('E1'!$D$3:$D$22,MATCH(TRUE,ISBLANK('E1'!$E$3:$E$22),0),1))","v":""},{"$f":"NOW()","v":43688.614419444442},{"$f":"IF(E4=\"Arrivée\",\"\",J4-I4)","v":""}]
[null,"E2",{"$f":"IF(OR(F5=0,E5=\"En Course\"),\"\",VLOOKUP(MAX('E2'!$E$3:$E$22),'E2'!$E$3:$F$22,2,FALSE))","v":""},{"$f":"IF(OR(F5=0,E5=\"Arrivée\"),INDEX('E2'!$B$3:$B$22,MATCH(TRUE,ISBLANK('E2'!$D$3:$D$22),0),1),\"\")","v":" "},{"$f":"IF('E2'!D30='E2'!E30,\"Arrivée\",\"En Course\")","v":"Arrivée"},{"$f":"'E2'!D30","v":0},{"$f":"IF(ISBLANK('E2'!$Q$23),\"\",'E2'!$Q$23)","v":""},{"$f":"Synthèse!B6","v":"     "},{"$f":"IF(OR(F5=0,E5=\"Arrivée\"),\"\",INDEX('E2'!$D$3:$D$22,MATCH(TRUE,ISBLANK('E2'!$E$3:$E$22),0),1))","v":""},{"$f":"NOW()","v":43688.614419444442},{"$f":"IF(E5=\"Arrivée\",\"\",J5-I5)","v":""}]
[null,"E3",{"$f":"IF(OR(F6=0,E6=\"En Course\"),\"\",VLOOKUP(MAX('E3'!$E$3:$E$22),'E3'!$E$3:$F$22,2,FALSE))","v":""},{"$f":"IF(OR(F6=0,E6=\"Arrivée\"),INDEX('E3'!$B$3:$B$22,MATCH(TRUE,ISBLANK('E3'!$D$3:$D$22),0),1),\"\")","v":" "},{"$f":"IF('E3'!D30='E3'!E30,\"Arrivée\",\"En Course\")","v":"Arrivée"},{"$f":"'E3'!D30","v":0},{"$f":"IF(ISBLANK('E3'!$Q$23),\"\",'E3'!$Q$23)","v":""},{"$f":"Synthèse!B7","v":"     "},{"$f":"IF(OR(F6=0,E6=\"Arrivée\"),\"\",INDEX('E3'!$D$3:$D$22,F6,1))","v":""},43688.614419444442,""]
[null,"E4",{"$f":"IF(OR(F7=0,E7=\"En Course\"),\"\",VLOOKUP(MAX('E4'!$E$3:$E$22),'E4'!$E$3:$F$22,2,FALSE))","v":""},{"$f":"IF(OR(F7=0,E7=\"Arrivée\"),INDEX('E4'!$B$3:$B$22,MATCH(TRUE,ISBLANK('E4'!$D$3:$D$22),0),1),\"\")","v":" "},{"$f":"IF('E4'!D30='E4'!E30,\"Arrivée\",\"En Course\")","v":"Arrivée"},{"$f":"'E4'!D30","v":0},{"$f":"IF(ISBLANK('E4'!$Q$23),\"\",'E4'!$Q$23)","v":""},{"$f":"Synthèse!B8","v":"     "},{"$f":"IF(OR(F7=0,E7=\"Arrivée\"),\"\",INDEX('E4'!$D$3:$D$22,F7,1))","v":""},43688.614419444442,""]
[null,"E5",{"$f":"IF(OR(F8=0,E8=\"En Course\"),\"\",VLOOKUP(MAX('E5'!$E$3:$E$22),'E5'!$E$3:$F$22,2,FALSE))","v":""},{"$f":"IF(OR(F8=0,E8=\"Arrivée\"),INDEX('E5'!$B$3:$B$22,MATCH(TRUE,ISBLANK('E5'!$D$3:$D$22),0),1),\"\")","v":" "},{"$f":"IF('E5'!D30='E5'!E30,\"Arrivée\",\"En Course\")","v":"Arrivée"},{"$f":"'E5'!D30","v":0},{"$f":"IF(ISBLANK('E5'!$Q$23),\"\",'E5'!$Q$23)","v":""},{"$f":"Synthèse!B9","v":"     "},{"$f":"IF(OR(F8=0,E8=\"Arrivée\"),\"\",INDEX('E5'!$D$3:$D$22,F8,1))","v":""},43688.614419444442,""]
[null,"E6",{"$f":"IF(OR(F9=0,E9=\"En Course\"),\"\",VLOOKUP(MAX('E6'!$E$3:$E$22),'E6'!$E$3:$F$22,2,FALSE))","v":""},{"$f":"IF(OR(F9=0,E9=\"Arrivée\"),INDEX('E6'!$B$3:$B$22,MATCH(TRUE,ISBLANK('E6'!$D$3:$D$22),0),1),\"\")","v":" "},{"$f":"IF('E6'!D30='E6'!E30,\"Arrivée\",\"En Course\")","v":"Arrivée"},{"$f":"'E6'!D30","v":0},{"$f":"IF(ISBLANK('E6'!$Q$23),\"\",'E6'!$Q$23)","v":""},{"$f":"Synthèse!B10","v":"     "},{"$f":"IF(OR(F9=0,E9=\"Arrivée\"),\"\",INDEX('E6'!$D$3:$D$22,F9,1))","v":""},43688.614419444442,""]
[null,"E7",{"$f":"IF(OR(F10=0,E10=\"En Course\"),\"\",VLOOKUP(MAX('E7'!$E$3:$E$22),'E7'!$E$3:$F$22,2,FALSE))","v":""},{"$f":"IF(OR(F10=0,E10=\"Arrivée\"),INDEX('E7'!$B$3:$B$22,MATCH(TRUE,ISBLANK('E7'!$D$3:$D$22),0),1),\"\")","v":" "},{"$f":"IF('E7'!D30='E7'!E30,\"Arrivée\",\"En Course\")","v":"Arrivée"},{"$f":"'E7'!D30","v":0},{"$f":"IF(ISBLANK('E7'!$Q$23),\"\",'E7'!$Q$23)","v":""},{"$f":"Synthèse!B11","v":"     "},{"$f":"IF(OR(F10=0,E10=\"Arrivée\"),\"\",INDEX('E7'!$D$3:$D$22,F10,1))","v":""},43688.614419444442,""]
[null,"E8",{"$f":"IF(OR(F11=0,E11=\"En Course\"),\"\",VLOOKUP(MAX('E8'!$E$3:$E$22),'E8'!$E$3:$F$22,2,FALSE))","v":""},{"$f":"IF(OR(F11=0,E11=\"Arrivée\"),INDEX('E8'!$B$3:$B$22,MATCH(TRUE,ISBLANK('E8'!$D$3:$D$22),0),1),\"\")","v":" "},{"$f":"IF('E8'!D30='E8'!E30,\"Arrivée\",\"En Course\")","v":"Arrivée"},{"$f":"'E8'!D30","v":0},{"$f":"IF(ISBLANK('E8'!$Q$23),\"\",'E8'!$Q$23)","v":""},{"$f":"Synthèse!B12","v":"     "},{"$f":"IF(OR(F11=0,E11=\"Arrivée\"),\"\",INDEX('E8'!$D$3:$D$22,F11,1))","v":""},43688.614419444442,""]
[null,"E9",{"$f":"IF(OR(F12=0,E12=\"En Course\"),\"\",VLOOKUP(MAX('E9'!$E$3:$E$22),'E9'!$E$3:$F$22,2,FALSE))","v":""},{"$f":"IF(OR(F12=0,E12=\"Arrivée\"),INDEX('E9'!$B$3:$B$22,MATCH(TRUE,ISBLANK('E9'!$D$3:$D$22),0),1),\"\")","v":" "},{"$f":"IF('E9'!D30='E9'!E30,\"Arrivée\",\"En Course\")","v":"Arrivée"},{"$f":"'E9'!D30","v":0},{"$f":"IF(ISBLANK('E9'!$Q$23),\"\",'E9'!$Q$23)","v":""},{"$f":"Synthèse!B13","v":"     "},{"$f":"IF(OR(F12=0,E12=\"Arrivée\"),\"\",INDEX('E9'!$D$3:$D$22,F12,1))","v":""},43688.614419444442,""]
[null,"E10",{"$f":"IF(OR(F13=0,E13=\"En Course\"),\"\",VLOOKUP(MAX('E10'!$E$3:$E$22),'E10'!$E$3:$F$22,2,FALSE))","v":""},{"$f":"IF(OR(F13=0,E13=\"Arrivée\"),INDEX('E10'!$B$3:$B$22,MATCH(TRUE,ISBLANK('E10'!$D$3:$D$22),0),1),\"\")","v":" "},{"$f":"IF('E10'!D30='E10'!E30,\"Arrivée\",\"En Course\")","v":"Arrivée"},{"$f":"'E10'!D30","v":0},{"$f":"IF(ISBLANK('E10'!$Q$23),\"\",'E10'!$Q$23)","v":""},{"$f":"Synthèse!B14","v":"     "},{"$f":"IF(OR(F13=0,E13=\"Arrivée\"),\"\",INDEX('E10'!$D$3:$D$22,F13,1))","v":""},43688.614419444442,""]
[null,"E11",{"$f":"IF(OR(F14=0,E14=\"En Course\"),\"\",VLOOKUP(MAX('E11'!$E$3:$E$22),'E11'!$E$3:$F$22,2,FALSE))","v":""},{"$f":"IF(OR(F14=0,E14=\"Arrivée\"),INDEX('E11'!$B$3:$B$22,MATCH(TRUE,ISBLANK('E11'!$D$3:$D$22),0),1),\"\")","v":" "},{"$f":"IF('E11'!D30='E11'!E30,\"Arrivée\",\"En Course\")","v":"Arrivée"},{"$f":"'E11'!D30","v":0},{"$f":"IF(ISBLANK('E11'!$Q$23),\"\",'E11'!$Q$23)","v":""},{"$f":"Synthèse!B15","v":"     "},{"$f":"IF(OR(F14=0,E14=\"Arrivée\"),\"\",INDEX('E11'!$D$3:$D$22,F14,1))","v":""},43688.614419444442,""]
[null,"E12",{"$f":"IF(OR(F15=0,E15=\"En Course\"),\"\",VLOOKUP(MAX('E12'!$E$3:$E$22),'E12'!$E$3:$F$22,2,FALSE))","v":""},{"$f":"IF(OR(F15=0,E15=\"Arrivée\"),INDEX('E12'!$B$3:$B$22,MATCH(TRUE,ISBLANK('E12'!$D$3:$D$22),0),1),\"\")","v":" "},{"$f":"IF('E12'!D30='E12'!E30,\"Arrivée\",\"En Course\")","v":"Arrivée"},{"$f":"'E12'!D30","v":0},{"$f":"IF(ISBLANK('E12'!$Q$23),\"\",'E12'!$Q$23)","v":""},{"$f":"Synthèse!B16","v":"     "},{"$f":"IF(OR(F15=0,E15=\"Arrivée\"),\"\",INDEX('E12'!$D$3:$D$22,F15,1))","v":""},43688.614419444442,""]
[null,"E13",{"$f":"IF(OR(F16=0,E16=\"En Course\"),\"\",VLOOKUP(MAX('E13'!$E$3:$E$22),'E13'!$E$3:$F$22,2,FALSE))","v":""},{"$f":"IF(OR(F16=0,E16=\"Arrivée\"),INDEX('E13'!$B$3:$B$22,MATCH(TRUE,ISBLANK('E13'!$D$3:$D$22),0),1),\"\")","v":" "},{"$f":"IF('E13'!D30='E13'!E30,\"Arrivée\",\"En Course\")","v":"Arrivée"},{"$f":"'E13'!D30","v":0},{"$f":"IF(ISBLANK('E13'!$Q$23),\"\",'E13'!$Q$23)","v":""},{"$f":"Synthèse!B17","v":"     "},{"$f":"IF(OR(F16=0,E16=\"Arrivée\"),\"\",INDEX('E13'!$D$3:$D$22,F16,1))","v":""},43688.614419444442,""]
[null,"E14",{"$f":"IF(OR(F17=0,E17=\"En Course\"),\"\",VLOOKUP(MAX('E14'!$E$3:$E$22),'E14'!$E$3:$F$22,2,FALSE))","v":""},{"$f":"IF(OR(F17=0,E17=\"Arrivée\"),INDEX('E14'!$B$3:$B$22,MATCH(TRUE,ISBLANK('E14'!$D$3:$D$22),0),1),\"\")","v":" "},{"$f":"IF('E14'!D30='E14'!E30,\"Arrivée\",\"En Course\")","v":"Arrivée"},{"$f":"'E14'!D30","v":0},{"$f":"IF(ISBLANK('E14'!$Q$23),\"\",'E14'!$Q$23)","v":""},{"$f":"Synthèse!B18","v":"     "},{"$f":"IF(OR(F17=0,E17=\"Arrivée\"),\"\",INDEX('E14'!$D$3:$D$22,F17,1))","v":""},43688.614419444442,""]
[null,"E15",{"$f":"IF(OR(F18=0,E18=\"En Course\"),\"\",VLOOKUP(MAX('E15'!$E$3:$E$22),'E15'!$E$3:$F$22,2,FALSE))","v":""},{"$f":"IF(OR(F18=0,E18=\"Arrivée\"),INDEX('E15'!$B$3:$B$22,MATCH(TRUE,ISBLANK('E15'!$D$3:$D$22),0),1),\"\")","v":" "},{"$f":"IF('E15'!D30='E15'!E30,\"Arrivée\",\"En Course\")","v":"Arrivée"},{"$f":"'E15'!D30","v":0},{"$f":"IF(ISBLANK('E15'!$Q$23),\"\",'E15'!$Q$23)","v":""},{"$f":"Synthèse!B19","v":"     "},{"$f":"IF(OR(F18=0,E18=\"Arrivée\"),\"\",INDEX('E15'!$D$3:$D$22,F18,1))","v":""},43688.614419444442,""]
[null,"E16",{"$f":"IF(OR(F19=0,E19=\"En Course\"),\"\",VLOOKUP(MAX('E16'!$E$3:$E$22),'E16'!$E$3:$F$22,2,FALSE))","v":""},{"$f":"IF(OR(F19=0,E19=\"Arrivée\"),INDEX('E16'!$B$3:$B$22,MATCH(TRUE,ISBLANK('E16'!$D$3:$D$22),0),1),\"\")","v":" "},{"$f":"IF('E16'!D30='E16'!E30,\"Arrivée\",\"En Course\")","v":"Arrivée"},{"$f":"'E16'!D30","v":0},{"$f":"IF(ISBLANK('E16'!$Q$23),\"\",'E16'!$Q$23)","v":""},{"$f":"Synthèse!B20","v":"     "},{"$f":"IF(OR(F19=0,E19=\"Arrivée\"),\"\",INDEX('E16'!$D$3:$D$22,F19,1))","v":""},43688.614419444442,""]
[null,"E17",{"$f":"IF(OR(F20=0,E20=\"En Course\"),\"\",VLOOKUP(MAX('E17'!$E$3:$E$22),'E17'!$E$3:$F$22,2,FALSE))","v":""},{"$f":"IF(OR(F20=0,E20=\"Arrivée\"),INDEX('E17'!$B$3:$B$22,MATCH(TRUE,ISBLANK('E17'!$D$3:$D$22),0),1),\"\")","v":" "},{"$f":"IF('E17'!D30='E17'!E30,\"Arrivée\",\"En Course\")","v":"Arrivée"},{"$f":"'E17'!D30","v":0},{"$f":"IF(ISBLANK('E17'!$Q$23),\"\",'E17'!$Q$23)","v":""},{"$f":"Synthèse!B21","v":"     "},{"$f":"IF(OR(F20=0,E20=\"Arrivée\"),\"\",INDEX('E17'!$D$3:$D$22,F20,1))","v":""},43688.614419444442,""]
[null,"E18",{"$f":"IF(OR(F21=0,E21=\"En Course\"),\"\",VLOOKUP(MAX('E18'!$E$3:$E$22),'E18'!$E$3:$F$22,2,FALSE))","v":""},{"$f":"IF(OR(F21=0,E21=\"Arrivée\"),INDEX('E18'!$B$3:$B$22,MATCH(TRUE,ISBLANK('E18'!$D$3:$D$22),0),1),\"\")","v":" "},{"$f":"IF('E18'!D30='E18'!E30,\"Arrivée\",\"En Course\")","v":"Arrivée"},{"$f":"'E18'!D30","v":0},{"$f":"IF(ISBLANK('E18'!$Q$23),\"\",'E18'!$Q$23)","v":""},{"$f":"Synthèse!B22","v":"     "},{"$f":"IF(OR(F21=0,E21=\"Arrivée\"),\"\",INDEX('E18'!$D$3:$D$22,F21,1))","v":""},43688.614419444442,""]
[null,"E19",{"$f":"IF(OR(F22=0,E22=\"En Course\"),\"\",VLOOKUP(MAX('E19'!$E$3:$E$22),'E19'!$E$3:$F$22,2,FALSE))","v":""},{"$f":"IF(OR(F22=0,E22=\"Arrivée\"),INDEX('E19'!$B$3:$B$22,MATCH(TRUE,ISBLANK('E19'!$D$3:$D$22),0),1),\"\")","v":" "},{"$f":"IF('E19'!D30='E19'!E30,\"Arrivée\",\"En Course\")","v":"Arrivée"},{"$f":"'E19'!D30","v":0},{"$f":"IF(ISBLANK('E19'!$Q$23),\"\",'E19'!$Q$23)","v":""},{"$f":"Synthèse!B23","v":"     "},{"$f":"IF(OR(F22=0,E22=\"Arrivée\"),\"\",INDEX('E19'!$D$3:$D$22,F22,1))","v":""},43688.614419444442,""]
[null,"E20",{"$f":"IF(OR(F23=0,E23=\"En Course\"),\"\",VLOOKUP(MAX('E20'!$E$3:$E$22),'E20'!$E$3:$F$22,2,FALSE))","v":""},{"$f":"IF(OR(F23=0,E23=\"Arrivée\"),INDEX('E20'!$B$3:$B$22,MATCH(TRUE,ISBLANK('E20'!$D$3:$D$22),0),1),\"\")","v":" "},{"$f":"IF('E20'!D30='E20'!E30,\"Arrivée\",\"En Course\")","v":"Arrivée"},{"$f":"'E20'!D30","v":0},{"$f":"IF(ISBLANK('E20'!$Q$23),\"\",'E20'!$Q$23)","v":""},{"$f":"Synthèse!B24","v":"     "},{"$f":"IF(OR(F23=0,E23=\"Arrivée\"),\"\",INDEX('E20'!$D$3:$D$22,F23,1))","v":""},43688.614419444442,""]
[null,"E21",{"$f":"IF(OR(F24=0,E24=\"En Course\"),\"\",VLOOKUP(MAX('E21'!$E$3:$E$22),'E21'!$E$3:$F$22,2,FALSE))","v":""},{"$f":"IF(OR(F24=0,E24=\"Arrivée\"),INDEX('E21'!$B$3:$B$22,MATCH(TRUE,ISBLANK('E21'!$D$3:$D$22),0),1),\"\")","v":" "},{"$f":"IF('E21'!D30='E21'!E30,\"Arrivée\",\"En Course\")","v":"Arrivée"},{"$f":"'E21'!D30","v":0},{"$f":"IF(ISBLANK('E21'!$Q$23),\"\",'E21'!$Q$23)","v":""},{"$f":"Synthèse!B25","v":"     "},{"$f":"IF(OR(F24=0,E24=\"Arrivée\"),\"\",INDEX('E21'!$D$3:$D$22,F24,1))","v":""},43688.614419444442,""]
[null,"E22",{"$f":"IF(OR(F25=0,E25=\"En Course\"),\"\",VLOOKUP(MAX('E22'!$E$3:$E$22),'E22'!$E$3:$F$22,2,FALSE))","v":""},{"$f":"IF(OR(F25=0,E25=\"Arrivée\"),INDEX('E22'!$B$3:$B$22,MATCH(TRUE,ISBLANK('E22'!$D$3:$D$22),0),1),\"\")","v":" "},{"$f":"IF('E22'!D30='E22'!E30,\"Arrivée\",\"En Course\")","v":"Arrivée"},{"$f":"'E22'!D30","v":0},{"$f":"IF(ISBLANK('E22'!$Q$23),\"\",'E22'!$Q$23)","v":""},{"$f":"Synthèse!B26","v":"     "},{"$f":"IF(OR(F25=0,E25=\"Arrivée\"),\"\",INDEX('E22'!$D$3:$D$22,F25,1))","v":""},43688.614419444442,""]
[null,"E23",{"$f":"IF(OR(F26=0,E26=\"En Course\"),\"\",VLOOKUP(MAX('E23'!$E$3:$E$22),'E23'!$E$3:$F$22,2,FALSE))","v":""},{"$f":"IF(OR(F26=0,E26=\"Arrivée\"),INDEX('E23'!$B$3:$B$22,MATCH(TRUE,ISBLANK('E23'!$D$3:$D$22),0),1),\"\")","v":" "},{"$f":"IF('E23'!D30='E23'!E30,\"Arrivée\",\"En Course\")","v":"Arrivée"},{"$f":"'E23'!D30","v":0},{"$f":"IF(ISBLANK('E23'!$Q$23),\"\",'E23'!$Q$23)","v":""},{"$f":"Synthèse!B27","v":"     "},{"$f":"IF(OR(F26=0,E26=\"Arrivée\"),\"\",INDEX('E23'!$D$3:$D$22,F26,1))","v":""},43688.614419444442,""]
[null,"E24",{"$f":"IF(OR(F27=0,E27=\"En Course\"),\"\",VLOOKUP(MAX('E24'!$E$3:$E$22),'E24'!$E$3:$F$22,2,FALSE))","v":""},{"$f":"IF(OR(F27=0,E27=\"Arrivée\"),INDEX('E24'!$B$3:$B$22,MATCH(TRUE,ISBLANK('E24'!$D$3:$D$22),0),1),\"\")","v":" "},{"$f":"IF('E24'!D30='E24'!E30,\"Arrivée\",\"En Course\")","v":"Arrivée"},{"$f":"'E24'!D30","v":0},{"$f":"IF(ISBLANK('E24'!$Q$23),\"\",'E24'!$Q$23)","v":""},{"$f":"Synthèse!B28","v":"     "},{"$f":"IF(OR(F27=0,E27=\"Arrivée\"),\"\",INDEX('E24'!$D$3:$D$22,F27,1))","v":""},43688.614419444442,""]
[null,"E25",{"$f":"IF(OR(F28=0,E28=\"En Course\"),\"\",VLOOKUP(MAX('E25'!$E$3:$E$22),'E25'!$E$3:$F$22,2,FALSE))","v":""},{"$f":"IF(OR(F28=0,E28=\"Arrivée\"),INDEX('E25'!$B$3:$B$22,MATCH(TRUE,ISBLANK('E25'!$D$3:$D$22),0),1),\"\")","v":" "},{"$f":"IF('E25'!D30='E25'!E30,\"Arrivée\",\"En Course\")","v":"Arrivée"},{"$f":"'E25'!D30","v":0},{"$f":"IF(ISBLANK('E25'!$Q$23),\"\",'E25'!$Q$23)","v":""},{"$f":"Synthèse!B29","v":"     "},{"$f":"IF(OR(F28=0,E28=\"Arrivée\"),\"\",INDEX('E25'!$D$3:$D$22,F28,1))","v":""},43688.614419444442,""]
[null,"E26",{"$f":"IF(OR(F29=0,E29=\"En Course\"),\"\",VLOOKUP(MAX('E26'!$E$3:$E$22),'E26'!$E$3:$F$22,2,FALSE))","v":""},{"$f":"IF(OR(F29=0,E29=\"Arrivée\"),INDEX('E26'!$B$3:$B$22,MATCH(TRUE,ISBLANK('E26'!$D$3:$D$22),0),1),\"\")","v":" "},{"$f":"IF('E26'!D30='E26'!E30,\"Arrivée\",\"En Course\")","v":"Arrivée"},{"$f":"'E26'!D30","v":0},{"$f":"IF(ISBLANK('E26'!$Q$23),\"\",'E26'!$Q$23)","v":""},{"$f":"Synthèse!B30","v":"     "},{"$f":"IF(OR(F29=0,E29=\"Arrivée\"),\"\",INDEX('E26'!$D$3:$D$22,F29,1))","v":""},43688.614419444442,""]
[null,"E27",{"$f":"IF(OR(F30=0,E30=\"En Course\"),\"\",VLOOKUP(MAX('E27'!$E$3:$E$22),'E27'!$E$3:$F$22,2,FALSE))","v":""},{"$f":"IF(OR(F30=0,E30=\"Arrivée\"),INDEX('E27'!$B$3:$B$22,MATCH(TRUE,ISBLANK('E27'!$D$3:$D$22),0),1),\"\")","v":" "},{"$f":"IF('E27'!D30='E27'!E30,\"Arrivée\",\"En Course\")","v":"Arrivée"},{"$f":"'E27'!D30","v":0},{"$f":"IF(ISBLANK('E27'!$Q$23),\"\",'E27'!$Q$23)","v":""},{"$f":"Synthèse!B31","v":"     "},{"$f":"IF(OR(F30=0,E30=\"Arrivée\"),\"\",INDEX('E27'!$D$3:$D$22,F30,1))","v":""},43688.614419444442,""]
[null,"E28",{"$f":"IF(OR(F31=0,E31=\"En Course\"),\"\",VLOOKUP(MAX('E28'!$E$3:$E$22),'E28'!$E$3:$F$22,2,FALSE))","v":""},{"$f":"IF(OR(F31=0,E31=\"Arrivée\"),INDEX('E28'!$B$3:$B$22,MATCH(TRUE,ISBLANK('E28'!$D$3:$D$22),0),1),\"\")","v":" "},{"$f":"IF('E28'!D30='E28'!E30,\"Arrivée\",\"En Course\")","v":"Arrivée"},{"$f":"'E28'!D30","v":0},{"$f":"IF(ISBLANK('E28'!$Q$23),\"\",'E28'!$Q$23)","v":""},{"$f":"Synthèse!B32","v":"     "},{"$f":"IF(OR(F31=0,E31=\"Arrivée\"),\"\",INDEX('E28'!$D$3:$D$22,F31,1))","v":""},43688.614419444442,""]
[null,"E29",{"$f":"IF(OR(F32=0,E32=\"En Course\"),\"\",VLOOKUP(MAX('E29'!$E$3:$E$22),'E29'!$E$3:$F$22,2,FALSE))","v":""},{"$f":"IF(OR(F32=0,E32=\"Arrivée\"),INDEX('E29'!$B$3:$B$22,MATCH(TRUE,ISBLANK('E29'!$D$3:$D$22),0),1),\"\")","v":" "},{"$f":"IF('E29'!D30='E29'!E30,\"Arrivée\",\"En Course\")","v":"Arrivée"},{"$f":"'E29'!D30","v":0},{"$f":"IF(ISBLANK('E29'!$Q$23),\"\",'E29'!$Q$23)","v":""},{"$f":"Synthèse!B33","v":"     "},{"$f":"IF(OR(F32=0,E32=\"Arrivée\"),\"\",INDEX('E29'!$D$3:$D$22,F32,1))","v":""},43688.614419444442,""]
[null,"E30",{"$f":"IF(OR(F33=0,E33=\"En Course\"),\"\",VLOOKUP(MAX('E30'!$E$3:$E$22),'E30'!$E$3:$F$22,2,FALSE))","v":""},{"$f":"IF(OR(F33=0,E33=\"Arrivée\"),INDEX('E30'!$B$3:$B$22,MATCH(TRUE,ISBLANK('E30'!$D$3:$D$22),0),1),\"\")","v":" "},{"$f":"IF('E30'!D30='E30'!E30,\"Arrivée\",\"En Course\")","v":"Arrivée"},{"$f":"'E30'!D30","v":0},{"$f":"IF(ISBLANK('E30'!$Q$23),\"\",'E30'!$Q$23)","v":""},{"$f":"Synthèse!B34","v":"     "},{"$f":"IF(OR(F33=0,E33=\"Arrivée\"),\"\",INDEX('E30'!$D$3:$D$22,F33,1))","v":""},43688.614419444442,""]

{"sheet":"Circuits","index":1,"n_rows":25,"n_cols":63,"rows_kept":25,"cut":false,"hidden":false,"merged":[]}
[null,"LISTE DES CIRCUITS \nObligatoire si vous voulez comparer les équipes sur un même circuit",null,"Equipe 1",null,"Equipe 2",null,"Equipe 3",null,"Equipe 4",null,"Equipe 5",null,"Equipe 6",null,"Equipe 7",null,"Equipe 8",null,"Equipe 9",null,"Equipe 10",null,"Equipe 11",null,"Equipe 12",null,"Equipe 13",null,"Equipe 14",null,"Equipe 15",null,"Equipe 16",null,"Equipe 17",null,"Equipe 18",null,"Equipe 19",null,"Equipe 20",null,"Equipe 21",null,"Equipe 22",null,"Equipe 23",null,"Equipe 24",null,"Equipe 25",null,"Equipe 26",null,"Equipe 27",null,"Equipe 28",null,"Equipe 29",null,"Equipe 30"]
[null,"Nom Circuits ou Numéros de postes","nb","N° Balises","NB","N° Balises","NB","N° Balises","NB","N° Balises","NB","N° Balises","NB","N° Balises","NB","N° Balises","NB","N° Balises","NB","N° Balises","NB","N° Balises","NB","N° Balises","NB","N° Balises","NB","N° Balises","NB","N° Balises","NB","N° Balises","NB","N° Balises","NB","N° Balises","NB","N° Balises","NB","N° Balises","NB","N° Balises","NB","N° Balises","NB","N° Balises","NB","N° Balises","NB","N° Balises","NB","N° Balises","NB","N° Balises","NB","N° Balises","NB","N° Balises","NB","N° Balises","NB","N° Balises","NB"]
["Circuit 1"]
["Circuit 2"]
["Circuit 3"]
["Circuit 4"]
["Circuit 5"]
["Circuit 6"]
["Circuit 7"]
["Circuit 8"]
["Circuit 9"]
["Circuit 10"]
["Circuit 11"]
["Circuit 12"]
["Circuit 13"]
["Circuit 14"]
["Circuit 15"]
["Circuit 16"]
["Circuit 17"]
["Circuit 18"]
["Circuit 19"]
["Circuit 20"]
[]
[]
[null,null,null,null,null,null,"RETOUR ACCUEIL"]

{"sheet":"Liste classe","index":2,"n_rows":32,"n_cols":10,"rows_kept":32,"cut":false,"hidden":false,"merged":[]}
[]
[null,"LISTE DES ELEVES",null,null,1,2,3,4,5,6]
[null,"Pierre",null,"Equipe 1"]
[null,"Paul",null,"Equipe 2"]
[null,"Julie",null,"Equipe 3"]
[null,"Sophie",null,"Equipe 4"]
[null,"Polo",null,"Equipe 5"]
[null,"Greg",null,"Equipe 6"]
[null,"Anne",null,"Equipe 7"]
[null,"Sylve",null,"Equipe 8"]
[null,"Kaïs",null,"Equipe 9"]
[null,null,null,"Equipe 10"]
[null,null,null,"Equipe 11"]
[null,null,null,"Equipe 12"]
[null,null,null,"Equipe 13"]
[null,null,null,"Equipe 14"]
[null,null,null,"Equipe 15"]
[null,null,null,"Equipe 16"]
[null,null,null,"Equipe 17"]
[null,null,null,"Equipe 18"]
[null,null,null,"Equipe 19"]
[null,null,null,"Equipe 20"]
[null,null,null,"Equipe 21"]
[null,null,null,"Equipe 22"]
[null,null,null,"Equipe 23"]
[null,null,null,"Equipe 24"]
[null,null,null,"Equipe 25"]
[null,null,null,"Equipe 26"]
[null,null,null,"Equipe 27"]
[null,null,null,"Equipe 28"]
[null,null,null,"Equipe 29"]
[null,null,null,"Equipe 30"]

{"sheet":"Synthèse","index":3,"n_rows":34,"n_cols":74,"rows_kept":34,"cut":false,"hidden":false,"merged":[]}
["Equipe","Noms","Temps total de course","Temps moyen par circuit","NB balises trouvées","NB balises cherchées","NB circuits  "]
["MOYENNE",null,{"$f":"IF(SUM(C5:C34)=0,\" \",AVERAGEIF(C5:C34,\">0\",C5:C34))","v":" "},{"$f":"IF(SUM(D5:D34)=0,\" \",AVERAGEIF(D5:D34,\">0\",D5:D34))","v":" "}," "," "," ",null,null,null,null,null,null,"Temps limite (minutes)",null,null,null,null,null,null,6,null,{"$f":"U2/(24*60)","v":"00:06:00"}]
["MINIMUM",null,{"$f":"MIN(IF(C5:C34>0,C5:C34))","v":"00:00:00"},{"$f":"MIN(IF(D5:D34>0,D5:D34))","v":"00:00:00"},{"$f":"MIN(IF(E5:E34>0,E5:E34))","v":0},{"$f":"MIN(IF(F5:F34>0,F5:F34))","v":0},{"$f":"MIN(IF(G5:G34>0,G5:G34))","v":0},null,null,null,null,null,null,"Date",null,null,null,null,null,null,"2019-10-25"]
["MAXIMUM",null,{"$f":"MAX(C5:C34)","v":"00:00:00"},{"$f":"MAX(D5:D34)","v":"00:00:00"},0,0,0,null,null,null,null,null,null,"N° Séance",null,null,null,null,null,null,3]
["E1",{"$f":"CONCATENATE('Liste classe'!E3,\" \",'Liste classe'!F3,\" \",'Liste classe'!G3,\" \",'Liste classe'!H3,\" \",'Liste classe'!I3,\" \",'Liste classe'!J3)","v":"     "},{"$f":"'E1'!$F$24","v":"00:00:00"},{"$f":"'E1'!$F$26","v":" "},{"$f":"'E1'!$G$28","v":0},{"$f":"'E1'!$I$28","v":0},{"$f":"COUNTA('E1'!$D$3:$D$22)","v":0}]
["E2",{"$f":"CONCATENATE('Liste classe'!E4,\" \",'Liste classe'!F4,\" \",'Liste classe'!G4,\" \",'Liste classe'!H4,\" \",'Liste classe'!I4,\" \",'Liste classe'!J4)","v":"     "},{"$f":"'E2'!$F$24","v":"00:00:00"},{"$f":"'E2'!$F$26","v":" "},{"$f":"'E2'!$G$28","v":0},{"$f":"'E2'!$I$28","v":0},{"$f":"COUNTA('E2'!$D$3:$D$22)","v":0},null,null,null,null,null,null,null,"Eq 1",null,"Eq 2",null,"Eq 3",null,"Eq 4",null,"Eq 5",null,"Eq 6",null,"Eq 7",null,"Eq 8",null,"Eq 9",null,"Eq 10",null,"Eq 11",null,"Eq 12",null,"Eq 13",null,"Eq 14",null,"Eq 15",null,"Eq 16",null,"Eq 17",null,"Eq 18",null,"Eq 19",null,"Eq 20",null,"Eq 21",null,"Eq 22",null,"Eq 23",null,"Eq 24",null,"Eq 25",null,"Eq 26",null,"Eq 27",null,"Eq 28",null,"Eq 29",null,"Eq 30"]
["E3",{"$f":"CONCATENATE('Liste classe'!E5,\" \",'Liste classe'!F5,\" \",'Liste classe'!G5,\" \",'Liste classe'!H5,\" \",'Liste classe'!I5,\" \",'Liste classe'!J5)","v":"     "},{"$f":"'E3'!$F$24","v":"00:00:00"},{"$f":"'E3'!$F$26","v":" "},{"$f":"'E3'!$G$28","v":0},{"$f":"'E3'!$I$28","v":0},{"$f":"COUNTA('E3'!$D$3:$D$22)","v":0},null,null,null,"Circuits","nb","moy",null,{"$f":"IF(ISERROR(AVERAGE(O8:O27)),\"\",AVERAGE(O8:O27))","v":""},"","","","","","","","","","","","","","","","","","","","","","","","","","","","","","","",{"$f":"IF(ISERROR(AVERAGE(AU8:AU27)),\"\",AVERAGE(AU8:AU27))","v":""},"","","","","","","","","","","","","","","","","","","","","","","","","","",""]
["E4",{"$f":"CONCATENATE('Liste classe'!E6,\" \",'Liste classe'!F6,\" \",'Liste classe'!G6,\" \",'Liste classe'!H6,\" \",'Liste classe'!I6,\" \",'Liste classe'!J6)","v":"     "},{"$f":"'E4'!$F$24","v":"00:00:00"},{"$f":"'E4'!$F$26","v":" "},{"$f":"'E4'!$G$28","v":0},{"$f":"'E4'!$I$28","v":0},{"$f":"COUNTA('E4'!$D$3:$D$22)","v":0},null,null,null,{"$f":"IF(ISBLANK(Circuits!B3),\"\",Circuits!B3)","v":""},{"$f":"IF(ISBLANK(Circuits!C3),\"\",Circuits!C3)","v":""},{"$f":"IF(ISERROR(AVERAGE(O8,Q8,S8,U8,W8,Y8,AA8,AC8,AE8,AG8,AI8,AK8,AM8,AO8,AQ8,AS8,AU8,AW8,AY8,BA8,BC8,BE8,BG8,BI8,BK8,BM8,BO8,BQ8,BS8,BU8)),\"\",AVERAGE(O8,Q8,S8,U8,W8,Y8,AA8,AC8,AE8,AG8,AI8,AK8,AM8,AO8,AQ8,AS8,AU8,AW8,AY8,BA8,BC8,BE8,BG8,BI8,BK8,BM8,BO8,BQ8,BS8,BU8))","v":""},{"$f":"IF(ISERROR(AVERAGE(P8,R8,T8,V8,X8,Z8,AB8,AD8,AF8,AH8,AJ8,AL8,AN8,AP8,AR8,AT8,AV8,AX8,AZ8,BB8,BD8,BF8,BH8,BJ8,BL8,BN8,BP8,BR8,BT8,BV8)),\"\",AVERAGE(P8,R8,T8,V8,X8,Z8,AB8,AD8,AF8,AH8,AJ8,AL8,AN8,AP8,AR8,AT8,AV8,AX8,AZ8,BB8,BD8,BF8,BH8,BJ8,BL8,BN8,BP8,BR8,BT8,BV8))","v":""},{"$f":"IF(ISNA(VLOOKUP($K8,'E1'!$B$3:$G$22,5,FALSE)),\"\",VLOOKUP($K8,'E1'!$B$3:$G$22,5,FALSE))","v":""},{"$f":"IF(ISNA((VLOOKUP($K8,'E1'!$B$3:$G$22,6,FALSE))),\"\",IF(ISBLANK(VLOOKUP($K8,'E1'!$B$3:$G$22,6,FALSE)),\"\",VLOOKUP($K8,'E1'!$B$3:$G$22,6,FALSE)))","v":""},{"$f":"IF(ISNA(VLOOKUP($K8,'E2'!$B$3:$G$22,5,FALSE)),\"\",VLOOKUP($K8,'E2'!$B$3:$G$22,5,FALSE))","v":""},{"$f":"IF(ISNA((VLOOKUP($K8,'E2'!$B$3:$G$22,6,FALSE))),\"\",IF(ISBLANK(VLOOKUP($K8,'E2'!$B$3:$G$22,6,FALSE)),\"\",VLOOKUP($K8,'E2'!$B$3:$G$22,6,FALSE)))","v":""},{"$f":"IF(ISNA(VLOOKUP($K8,'E3'!$B$3:$G$22,5,FALSE)),\"\",VLOOKUP($K8,'E3'!$B$3:$G$22,5,FALSE))","v":""},{"$f":"IF(ISNA((VLOOKUP($K8,'E3'!$B$3:$G$22,6,FALSE))),\"\",IF(ISBLANK(VLOOKUP($K8,'E3'!$B$3:$G$22,6,FALSE)),\"\",VLOOKUP($K8,'E3'!$B$3:$G$22,6,FALSE)))","v":""},{"$f":"IF(ISNA(VLOOKUP($K8,'E4'!$B$3:$G$22,5,FALSE)),\"\",VLOOKUP($K8,'E4'!$B$3:$G$22,5,FALSE))","v":""},{"$f":"IF(ISNA((VLOOKUP($K8,'E4'!$B$3:$G$22,6,FALSE))),\"\",IF(ISBLANK(VLOOKUP($K8,'E4'!$B$3:$G$22,6,FALSE)),\"\",VLOOKUP($K8,'E4'!$B$3:$G$22,6,FALSE)))","v":""},{"$f":"IF(ISNA(VLOOKUP($K8,'E5'!$B$3:$G$22,5,FALSE)),\"\",VLOOKUP($K8,'E5'!$B$3:$G$22,5,FALSE))","v":""},{"$f":"IF(ISNA((VLOOKUP($K8,'E5'!$B$3:$G$22,6,FALSE))),\"\",IF(ISBLANK(VLOOKUP($K8,'E5'!$B$3:$G$22,6,FALSE)),\"\",VLOOKUP($K8,'E5'!$B$3:$G$22,6,FALSE)))","v":""},{"$f":"IF(ISNA(VLOOKUP($K8,'E6'!$B$3:$G$22,5,FALSE)),\"\",VLOOKUP($K8,'E6'!$B$3:$G$22,5,FALSE))","v":""},{"$f":"IF(ISNA((VLOOKUP($K8,'E6'!$B$3:$G$22,6,FALSE))),\"\",IF(ISBLANK(VLOOKUP($K8,'E6'!$B$3:$G$22,6,FALSE)),\"\",VLOOKUP($K8,'E6'!$B$3:$G$22,6,FALSE)))","v":""},{"$f":"IF(ISNA(VLOOKUP($K8,'E7'!$B$3:$G$22,5,FALSE)),\"\",VLOOKUP($K8,'E7'!$B$3:$G$22,5,FALSE))","v":""},{"$f":"IF(ISNA((VLOOKUP($K8,'E7'!$B$3:$G$22,6,FALSE))),\"\",IF(ISBLANK(VLOOKUP($K8,'E7'!$B$3:$G$22,6,FALSE)),\"\",VLOOKUP($K8,'E7'!$B$3:$G$22,6,FALSE)))","v":""},{"$f":"IF(ISNA(VLOOKUP($K8,'E8'!$B$3:$G$22,5,FALSE)),\"\",VLOOKUP($K8,'E8'!$B$3:$G$22,5,FALSE))","v":""},{"$f":"IF(ISNA((VLOOKUP($K8,'E8'!$B$3:$G$22,6,FALSE))),\"\",IF(ISBLANK(VLOOKUP($K8,'E8'!$B$3:$G$22,6,FALSE)),\"\",VLOOKUP($K8,'E8'!$B$3:$G$22,6,FALSE)))","v":""},{"$f":"IF(ISNA(VLOOKUP($K8,'E9'!$B$3:$G$22,5,FALSE)),\"\",VLOOKUP($K8,'E9'!$B$3:$G$22,5,FALSE))","v":""},{"$f":"IF(ISNA((VLOOKUP($K8,'E9'!$B$3:$G$22,6,FALSE))),\"\",IF(ISBLANK(VLOOKUP($K8,'E9'!$B$3:$G$22,6,FALSE)),\"\",VLOOKUP($K8,'E9'!$B$3:$G$22,6,FALSE)))","v":""},{"$f":"IF(ISNA(VLOOKUP($K8,'E10'!$B$3:$G$22,5,FALSE)),\"\",VLOOKUP($K8,'E10'!$B$3:$G$22,5,FALSE))","v":""},{"$f":"IF(ISNA((VLOOKUP($K8,'E10'!$B$3:$G$22,6,FALSE))),\"\",IF(ISBLANK(VLOOKUP($K8,'E10'!$B$3:$G$22,6,FALSE)),\"\",VLOOKUP($K8,'E10'!$B$3:$G$22,6,FALSE)))","v":""},{"$f":"IF(ISNA(VLOOKUP($K8,'E11'!$B$3:$G$22,5,FALSE)),\"\",VLOOKUP($K8,'E11'!$B$3:$G$22,5,FALSE))","v":""},{"$f":"IF(ISNA((VLOOKUP($K8,'E11'!$B$3:$G$22,6,FALSE))),\"\",IF(ISBLANK(VLOOKUP($K8,'E11'!$B$3:$G$22,6,FALSE)),\"\",VLOOKUP($K8,'E11'!$B$3:$G$22,6,FALSE)))","v":""},{"$f":"IF(ISNA(VLOOKUP($K8,'E12'!$B$3:$G$22,5,FALSE)),\"\",VLOOKUP($K8,'E12'!$B$3:$G$22,5,FALSE))","v":""},{"$f":"IF(ISNA((VLOOKUP($K8,'E12'!$B$3:$G$22,6,FALSE))),\"\",IF(ISBLANK(VLOOKUP($K8,'E12'!$B$3:$G$22,6,FALSE)),\"\",VLOOKUP($K8,'E12'!$B$3:$G$22,6,FALSE)))","v":""},{"$f":"IF(ISNA(VLOOKUP($K8,'E13'!$B$3:$G$22,5,FALSE)),\"\",VLOOKUP($K8,'E13'!$B$3:$G$22,5,FALSE))","v":""},{"$f":"IF(ISNA((VLOOKUP($K8,'E13'!$B$3:$G$22,6,FALSE))),\"\",IF(ISBLANK(VLOOKUP($K8,'E13'!$B$3:$G$22,6,FALSE)),\"\",VLOOKUP($K8,'E13'!$B$3:$G$22,6,FALSE)))","v":""},{"$f":"IF(ISNA(VLOOKUP($K8,'E14'!$B$3:$G$22,5,FALSE)),\"\",VLOOKUP($K8,'E14'!$B$3:$G$22,5,FALSE))","v":""},{"$f":"IF(ISNA((VLOOKUP($K8,'E14'!$B$3:$G$22,6,FALSE))),\"\",IF(ISBLANK(VLOOKUP($K8,'E14'!$B$3:$G$22,6,FALSE)),\"\",VLOOKUP($K8,'E14'!$B$3:$G$22,6,FALSE)))","v":""},{"$f":"IF(ISNA(VLOOKUP($K8,'E15'!$B$3:$G$22,5,FALSE)),\"\",VLOOKUP($K8,'E15'!$B$3:$G$22,5,FALSE))","v":""},{"$f":"IF(ISNA((VLOOKUP($K8,'E15'!$B$3:$G$22,6,FALSE))),\"\",IF(ISBLANK(VLOOKUP($K8,'E15'!$B$3:$G$22,6,FALSE)),\"\",VLOOKUP($K8,'E15'!$B$3:$G$22,6,FALSE)))","v":""},{"$f":"IF(ISNA(VLOOKUP($K8,'E16'!$B$3:$G$22,5,FALSE)),\"\",VLOOKUP($K8,'E16'!$B$3:$G$22,5,FALSE))","v":""},{"$f":"IF(ISNA((VLOOKUP($K8,'E16'!$B$3:$G$22,6,FALSE))),\"\",IF(ISBLANK(VLOOKUP($K8,'E16'!$B$3:$G$22,6,FALSE)),\"\",VLOOKUP($K8,'E16'!$B$3:$G$22,6,FALSE)))","v":""},{"$f":"IF(ISNA(VLOOKUP($K8,'E17'!$B$3:$G$22,5,FALSE)),\"\",VLOOKUP($K8,'E17'!$B$3:$G$22,5,FALSE))","v":""},{"$f":"IF(ISNA((VLOOKUP($K8,'E17'!$B$3:$G$22,6,FALSE))),\"\",IF(ISBLANK(VLOOKUP($K8,'E17'!$B$3:$G$22,6,FALSE)),\"\",VLOOKUP($K8,'E17'!$B$3:$G$22,6,FALSE)))","v":""},{"$f":"IF(ISNA(VLOOKUP($K8,'E18'!$B$3:$G$22,5,FALSE)),\"\",VLOOKUP($K8,'E18'!$B$3:$G$22,5,FALSE))","v":""},{"$f":"IF(ISNA((VLOOKUP($K8,'E18'!$B$3:$G$22,6,FALSE))),\"\",IF(ISBLANK(VLOOKUP($K8,'E18'!$B$3:$G$22,6,FALSE)),\"\",VLOOKUP($K8,'E18'!$B$3:$G$22,6,FALSE)))","v":""},{"$f":"IF(ISNA(VLOOKUP($K8,'E19'!$B$3:$G$22,5,FALSE)),\"\",VLOOKUP($K8,'E19'!$B$3:$G$22,5,FALSE))","v":""},{"$f":"IF(ISNA((VLOOKUP($K8,'E19'!$B$3:$G$22,6,FALSE))),\"\",IF(ISBLANK(VLOOKUP($K8,'E19'!$B$3:$G$22,6,FALSE)),\"\",VLOOKUP($K8,'E19'!$B$3:$G$22,6,FALSE)))","v":""},{"$f":"IF(ISNA(VLOOKUP($K8,'E20'!$B$3:$G$22,5,FALSE)),\"\",VLOOKUP($K8,'E20'!$B$3:$G$22,5,FALSE))","v":""},{"$f":"IF(ISNA((VLOOKUP($K8,'E20'!$B$3:$G$22,6,FALSE))),\"\",IF(ISBLANK(VLOOKUP($K8,'E20'!$B$3:$G$22,6,FALSE)),\"\",VLOOKUP($K8,'E20'!$B$3:$G$22,6,FALSE)))","v":""},{"$f":"IF(ISNA(VLOOKUP($K8,'E21'!$B$3:$G$22,5,FALSE)),\"\",VLOOKUP($K8,'E21'!$B$3:$G$22,5,FALSE))","v":""},{"$f":"IF(ISNA((VLOOKUP($K8,'E21'!$B$3:$G$22,6,FALSE))),\"\",IF(ISBLANK(VLOOKUP($K8,'E21'!$B$3:$G$22,6,FALSE)),\"\",VLOOKUP($K8,'E21'!$B$3:$G$22,6,FALSE)))","v":""},{"$f":"IF(ISNA(VLOOKUP($K8,'E22'!$B$3:$G$22,5,FALSE)),\"\",VLOOKUP($K8,'E22'!$B$3:$G$22,5,FALSE))","v":""},{"$f":"IF(ISNA((VLOOKUP($K8,'E22'!$B$3:$G$22,6,FALSE))),\"\",IF(ISBLANK(VLOOKUP($K8,'E22'!$B$3:$G$22,6,FALSE)),\"\",VLOOKUP($K8,'E22'!$B$3:$G$22,6,FALSE)))","v":""},{"$f":"IF(ISNA(VLOOKUP($K8,'E23'!$B$3:$G$22,5,FALSE)),\"\",VLOOKUP($K8,'E23'!$B$3:$G$22,5,FALSE))","v":""},{"$f":"IF(ISNA((VLOOKUP($K8,'E23'!$B$3:$G$22,6,FALSE))),\"\",IF(ISBLANK(VLOOKUP($K8,'E23'!$B$3:$G$22,6,FALSE)),\"\",VLOOKUP($K8,'E23'!$B$3:$G$22,6,FALSE)))","v":""},{"$f":"IF(ISNA(VLOOKUP($K8,'E24'!$B$3:$G$22,5,FALSE)),\"\",VLOOKUP($K8,'E24'!$B$3:$G$22,5,FALSE))","v":""},{"$f":"IF(ISNA((VLOOKUP($K8,'E24'!$B$3:$G$22,6,FALSE))),\"\",IF(ISBLANK(VLOOKUP($K8,'E24'!$B$3:$G$22,6,FALSE)),\"\",VLOOKUP($K8,'E24'!$B$3:$G$22,6,FALSE)))","v":""},{"$f":"IF(ISNA(VLOOKUP($K8,'E25'!$B$3:$G$22,5,FALSE)),\"\",VLOOKUP($K8,'E25'!$B$3:$G$22,5,FALSE))","v":""},{"$f":"IF(ISNA((VLOOKUP($K8,'E25'!$B$3:$G$22,6,FALSE))),\"\",IF(ISBLANK(VLOOKUP($K8,'E25'!$B$3:$G$22,6,FALSE)),\"\",VLOOKUP($K8,'E25'!$B$3:$G$22,6,FALSE)))","v":""},{"$f":"IF(ISNA(VLOOKUP($K8,'E26'!$B$3:$G$22,5,FALSE)),\"\",VLOOKUP($K8,'E26'!$B$3:$G$22,5,FALSE))","v":""},{"$f":"IF(ISNA((VLOOKUP($K8,'E26'!$B$3:$G$22,6,FALSE))),\"\",IF(ISBLANK(VLOOKUP($K8,'E26'!$B$3:$G$22,6,FALSE)),\"\",VLOOKUP($K8,'E26'!$B$3:$G$22,6,FALSE)))","v":""},{"$f":"IF(ISNA(VLOOKUP($K8,'E27'!$B$3:$G$22,5,FALSE)),\"\",VLOOKUP($K8,'E27'!$B$3:$G$22,5,FALSE))","v":""},{"$f":"IF(ISNA((VLOOKUP($K8,'E27'!$B$3:$G$22,6,FALSE))),\"\",IF(ISBLANK(VLOOKUP($K8,'E27'!$B$3:$G$22,6,FALSE)),\"\",VLOOKUP($K8,'E27'!$B$3:$G$22,6,FALSE)))","v":""},{"$f":"IF(ISNA(VLOOKUP($K8,'E28'!$B$3:$G$22,5,FALSE)),\"\",VLOOKUP($K8,'E28'!$B$3:$G$22,5,FALSE))","v":""},{"$f":"IF(ISNA((VLOOKUP($K8,'E28'!$B$3:$G$22,6,FALSE))),\"\",IF(ISBLANK(VLOOKUP($K8,'E28'!$B$3:$G$22,6,FALSE)),\"\",VLOOKUP($K8,'E28'!$B$3:$G$22,6,FALSE)))","v":""},{"$f":"IF(ISNA(VLOOKUP($K8,'E29'!$B$3:$G$22,5,FALSE)),\"\",VLOOKUP($K8,'E29'!$B$3:$G$22,5,FALSE))","v":""},{"$f":"IF(ISNA((VLOOKUP($K8,'E29'!$B$3:$G$22,6,FALSE))),\"\",IF(ISBLANK(VLOOKUP($K8,'E29'!$B$3:$G$22,6,FALSE)),\"\",VLOOKUP($K8,'E29'!$B$3:$G$22,6,FALSE)))","v":""},{"$f":"IF(ISNA(VLOOKUP($K8,'E30'!$B$3:$G$22,5,FALSE)),\"\",VLOOKUP($K8,'E30'!$B$3:$G$22,5,FALSE))","v":""},{"$f":"IF(ISNA((VLOOKUP($K8,'E30'!$B$3:$G$22,6,FALSE))),\"\",IF(ISBLANK(VLOOKUP($K8,'E30'!$B$3:$G$22,6,FALSE)),\"\",VLOOKUP($K8,'E30'!$B$3:$G$22,6,FALSE)))","v":""}]
["E5",{"$f":"CONCATENATE('Liste classe'!E7,\" \",'Liste classe'!F7,\" \",'Liste classe'!G7,\" \",'Liste classe'!H7,\" \",'Liste classe'!I7,\" \",'Liste classe'!J7)","v":"     "},{"$f":"'E5'!$F$24","v":"00:00:00"},{"$f":"'E5'!$F$26","v":" "},{"$f":"'E5'!$G$28","v":0},{"$f":"'E5'!$I$28","v":0},{"$f":"COUNTA('E5'!$D$3:$D$22)","v":0},null,null,null,{"$f":"IF(ISBLANK(Circuits!B4),\"\",Circuits!B4)","v":""},{"$f":"IF(ISBLANK(Circuits!C4),\"\",Circuits!C4)","v":""},{"$f":"IF(ISERROR(AVERAGE(O9,Q9,S9,U9,W9,Y9,AA9,AC9,AE9,AG9,AI9,AK9,AM9,AO9,AQ9,AS9,AU9,AW9,AY9,BA9,BC9,BE9,BG9,BI9,BK9,BM9,BO9,BQ9,BS9,BU9)),\"\",AVERAGE(O9,Q9,S9,U9,W9,Y9,AA9,AC9,AE9,AG9,AI9,AK9,AM9,AO9,AQ9,AS9,AU9,AW9,AY9,BA9,BC9,BE9,BG9,BI9,BK9,BM9,BO9,BQ9,BS9,BU9))","v":""},{"$f":"IF(ISERROR(AVERAGE(P9,R9,T9,V9,X9,Z9,AB9,AD9,AF9,AH9,AJ9,AL9,AN9,AP9,AR9,AT9,AV9,AX9,AZ9,BB9,BD9,BF9,BH9,BJ9,BL9,BN9,BP9,BR9,BT9,BV9)),\"\",AVERAGE(P9,R9,T9,V9,X9,Z9,AB9,AD9,AF9,AH9,AJ9,AL9,AN9,AP9,AR9,AT9,AV9,AX9,AZ9,BB9,BD9,BF9,BH9,BJ9,BL9,BN9,BP9,BR9,BT9,BV9))","v":""},{"$f":"IF(ISNA(VLOOKUP($K9,'E1'!$B$3:$G$22,5,FALSE)),\"\",VLOOKUP($K9,'E1'!$B$3:$G$22,5,FALSE))","v":""},{"$f":"IF(ISNA((VLOOKUP($K9,'E1'!$B$3:$G$22,6,FALSE))),\"\",IF(ISBLANK(VLOOKUP($K9,'E1'!$B$3:$G$22,6,FALSE)),\"\",VLOOKUP($K9,'E1'!$B$3:$G$22,6,FALSE)))","v":""},{"$f":"IF(ISNA(VLOOKUP($K9,'E2'!$B$3:$G$22,5,FALSE)),\"\",VLOOKUP($K9,'E2'!$B$3:$G$22,5,FALSE))","v":""},{"$f":"IF(ISNA((VLOOKUP($K9,'E2'!$B$3:$G$22,6,FALSE))),\"\",IF(ISBLANK(VLOOKUP($K9,'E2'!$B$3:$G$22,6,FALSE)),\"\",VLOOKUP($K9,'E2'!$B$3:$G$22,6,FALSE)))","v":""},{"$f":"IF(ISNA(VLOOKUP($K9,'E3'!$B$3:$G$22,5,FALSE)),\"\",VLOOKUP($K9,'E3'!$B$3:$G$22,5,FALSE))","v":""},{"$f":"IF(ISNA((VLOOKUP($K9,'E3'!$B$3:$G$22,6,FALSE))),\"\",IF(ISBLANK(VLOOKUP($K9,'E3'!$B$3:$G$22,6,FALSE)),\"\",VLOOKUP($K9,'E3'!$B$3:$G$22,6,FALSE)))","v":""},{"$f":"IF(ISNA(VLOOKUP($K9,'E4'!$B$3:$G$22,5,FALSE)),\"\",VLOOKUP($K9,'E4'!$B$3:$G$22,5,FALSE))","v":""},{"$f":"IF(ISNA((VLOOKUP($K9,'E4'!$B$3:$G$22,6,FALSE))),\"\",IF(ISBLANK(VLOOKUP($K9,'E4'!$B$3:$G$22,6,FALSE)),\"\",VLOOKUP($K9,'E4'!$B$3:$G$22,6,FALSE)))","v":""},{"$f":"IF(ISNA(VLOOKUP($K9,'E5'!$B$3:$G$22,5,FALSE)),\"\",VLOOKUP($K9,'E5'!$B$3:$G$22,5,FALSE))","v":""},{"$f":"IF(ISNA((VLOOKUP($K9,'E5'!$B$3:$G$22,6,FALSE))),\"\",IF(ISBLANK(VLOOKUP($K9,'E5'!$B$3:$G$22,6,FALSE)),\"\",VLOOKUP($K9,'E5'!$B$3:$G$22,6,FALSE)))","v":""},{"$f":"IF(ISNA(VLOOKUP($K9,'E6'!$B$3:$G$22,5,FALSE)),\"\",VLOOKUP($K9,'E6'!$B$3:$G$22,5,FALSE))","v":""},{"$f":"IF(ISNA((VLOOKUP($K9,'E6'!$B$3:$G$22,6,FALSE))),\"\",IF(ISBLANK(VLOOKUP($K9,'E6'!$B$3:$G$22,6,FALSE)),\"\",VLOOKUP($K9,'E6'!$B$3:$G$22,6,FALSE)))","v":""},{"$f":"IF(ISNA(VLOOKUP($K9,'E7'!$B$3:$G$22,5,FALSE)),\"\",VLOOKUP($K9,'E7'!$B$3:$G$22,5,FALSE))","v":""},{"$f":"IF(ISNA((VLOOKUP($K9,'E7'!$B$3:$G$22,6,FALSE))),\"\",IF(ISBLANK(VLOOKUP($K9,'E7'!$B$3:$G$22,6,FALSE)),\"\",VLOOKUP($K9,'E7'!$B$3:$G$22,6,FALSE)))","v":""},{"$f":"IF(ISNA(VLOOKUP($K9,'E8'!$B$3:$G$22,5,FALSE)),\"\",VLOOKUP($K9,'E8'!$B$3:$G$22,5,FALSE))","v":""},{"$f":"IF(ISNA((VLOOKUP($K9,'E8'!$B$3:$G$22,6,FALSE))),\"\",IF(ISBLANK(VLOOKUP($K9,'E8'!$B$3:$G$22,6,FALSE)),\"\",VLOOKUP($K9,'E8'!$B$3:$G$22,6,FALSE)))","v":""},{"$f":"IF(ISNA(VLOOKUP($K9,'E9'!$B$3:$G$22,5,FALSE)),\"\",VLOOKUP($K9,'E9'!$B$3:$G$22,5,FALSE))","v":""},{"$f":"IF(ISNA((VLOOKUP($K9,'E9'!$B$3:$G$22,6,FALSE))),\"\",IF(ISBLANK(VLOOKUP($K9,'E9'!$B$3:$G$22,6,FALSE)),\"\",VLOOKUP($K9,'E9'!$B$3:$G$22,6,FALSE)))","v":""},{"$f":"IF(ISNA(VLOOKUP($K9,'E10'!$B$3:$G$22,5,FALSE)),\"\",VLOOKUP($K9,'E10'!$B$3:$G$22,5,FALSE))","v":""},{"$f":"IF(ISNA((VLOOKUP($K9,'E10'!$B$3:$G$22,6,FALSE))),\"\",IF(ISBLANK(VLOOKUP($K9,'E10'!$B$3:$G$22,6,FALSE)),\"\",VLOOKUP($K9,'E10'!$B$3:$G$22,6,FALSE)))","v":""},{"$f":"IF(ISNA(VLOOKUP($K9,'E11'!$B$3:$G$22,5,FALSE)),\"\",VLOOKUP($K9,'E11'!$B$3:$G$22,5,FALSE))","v":""},{"$f":"IF(ISNA((VLOOKUP($K9,'E11'!$B$3:$G$22,6,FALSE))),\"\",IF(ISBLANK(VLOOKUP($K9,'E11'!$B$3:$G$22,6,FALSE)),\"\",VLOOKUP($K9,'E11'!$B$3:$G$22,6,FALSE)))","v":""},{"$f":"IF(ISNA(VLOOKUP($K9,'E12'!$B$3:$G$22,5,FALSE)),\"\",VLOOKUP($K9,'E12'!$B$3:$G$22,5,FALSE))","v":""},{"$f":"IF(ISNA((VLOOKUP($K9,'E12'!$B$3:$G$22,6,FALSE))),\"\",IF(ISBLANK(VLOOKUP($K9,'E12'!$B$3:$G$22,6,FALSE)),\"\",VLOOKUP($K9,'E12'!$B$3:$G$22,6,FALSE)))","v":""},{"$f":"IF(ISNA(VLOOKUP($K9,'E13'!$B$3:$G$22,5,FALSE)),\"\",VLOOKUP($K9,'E13'!$B$3:$G$22,5,FALSE))","v":""},{"$f":"IF(ISNA((VLOOKUP($K9,'E13'!$B$3:$G$22,6,FALSE))),\"\",IF(ISBLANK(VLOOKUP($K9,'E13'!$B$3:$G$22,6,FALSE)),\"\",VLOOKUP($K9,'E13'!$B$3:$G$22,6,FALSE)))","v":""},{"$f":"IF(ISNA(VLOOKUP($K9,'E14'!$B$3:$G$22,5,FALSE)),\"\",VLOOKUP($K9,'E14'!$B$3:$G$22,5,FALSE))","v":""},{"$f":"IF(ISNA((VLOOKUP($K9,'E14'!$B$3:$G$22,6,FALSE))),\"\",IF(ISBLANK(VLOOKUP($K9,'E14'!$B$3:$G$22,6,FALSE)),\"\",VLOOKUP($K9,'E14'!$B$3:$G$22,6,FALSE)))","v":""},{"$f":"IF(ISNA(VLOOKUP($K9,'E15'!$B$3:$G$22,5,FALSE)),\"\",VLOOKUP($K9,'E15'!$B$3:$G$22,5,FALSE))","v":""},{"$f":"IF(ISNA((VLOOKUP($K9,'E15'!$B$3:$G$22,6,FALSE))),\"\",IF(VLOOKUP($K9,'E15'!$B$3:$G$22,6,FALSE)=0,\"\",VLOOKUP($K9,'E15'!$B$3:$G$22,6,FALSE)))","v":""},{"$f":"IF(ISNA(VLOOKUP($K9,'E16'!$B$3:$G$22,5,FALSE)),\"\",VLOOKUP($K9,'E16'!$B$3:$G$22,5,FALSE))","v":""},{"$f":"IF(ISNA((VLOOKUP($K9,'E16'!$B$3:$G$22,6,FALSE))),\"\",IF(ISBLANK(VLOOKUP($K9,'E16'!$B$3:$G$22,6,FALSE)),\"\",VLOOKUP($K9,'E16'!$B$3:$G$22,6,FALSE)))","v":""},{"$f":"IF(ISNA(VLOOKUP($K9,'E17'!$B$3:$G$22,5,FALSE)),\"\",VLOOKUP($K9,'E17'!$B$3:$G$22,5,FALSE))","v":""},{"$f":"IF(ISNA((VLOOKUP($K9,'E17'!$B$3:$G$22,6,FALSE))),\"\",IF(ISBLANK(VLOOKUP($K9,'E17'!$B$3:$G$22,6,FALSE)),\"\",VLOOKUP($K9,'E17'!$B$3:$G$22,6,FALSE)))","v":""},{"$f":"IF(ISNA(VLOOKUP($K9,'E18'!$B$3:$G$22,5,FALSE)),\"\",VLOOKUP($K9,'E18'!$B$3:$G$22,5,FALSE))","v":""},{"$f":"IF(ISNA((VLOOKUP($K9,'E18'!$B$3:$G$22,6,FALSE))),\"\",IF(ISBLANK(VLOOKUP($K9,'E18'!$B$3:$G$22,6,FALSE)),\"\",VLOOKUP($K9,'E18'!$B$3:$G$22,6,FALSE)))","v":""},{"$f":"IF(ISNA(VLOOKUP($K9,'E19'!$B$3:$G$22,5,FALSE)),\"\",VLOOKUP($K9,'E19'!$B$3:$G$22,5,FALSE))","v":""},{"$f":"IF(ISNA((VLOOKUP($K9,'E19'!$B$3:$G$22,6,FALSE))),\"\",IF(ISBLANK(VLOOKUP($K9,'E19'!$B$3:$G$22,6,FALSE)),\"\",VLOOKUP($K9,'E19'!$B$3:$G$22,6,FALSE)))","v":""},{"$f":"IF(ISNA(VLOOKUP($K9,'E20'!$B$3:$G$22,5,FALSE)),\"\",VLOOKUP($K9,'E20'!$B$3:$G$22,5,FALSE))","v":""},{"$f":"IF(ISNA((VLOOKUP($K9,'E20'!$B$3:$G$22,6,FALSE))),\"\",IF(ISBLANK(VLOOKUP($K9,'E20'!$B$3:$G$22,6,FALSE)),\"\",VLOOKUP($K9,'E20'!$B$3:$G$22,6,FALSE)))","v":""},{"$f":"IF(ISNA(VLOOKUP($K9,'E21'!$B$3:$G$22,5,FALSE)),\"\",VLOOKUP($K9,'E21'!$B$3:$G$22,5,FALSE))","v":""},{"$f":"IF(ISNA((VLOOKUP($K9,'E21'!$B$3:$G$22,6,FALSE))),\"\",IF(ISBLANK(VLOOKUP($K9,'E21'!$B$3:$G$22,6,FALSE)),\"\",VLOOKUP($K9,'E21'!$B$3:$G$22,6,FALSE)))","v":""},{"$f":"IF(ISNA(VLOOKUP($K9,'E22'!$B$3:$G$22,5,FALSE)),\"\",VLOOKUP($K9,'E22'!$B$3:$G$22,5,FALSE))","v":""},{"$f":"IF(ISNA((VLOOKUP($K9,'E22'!$B$3:$G$22,6,FALSE))),\"\",IF(ISBLANK(VLOOKUP($K9,'E22'!$B$3:$G$22,6,FALSE)),\"\",VLOOKUP($K9,'E22'!$B$3:$G$22,6,FALSE)))","v":""},{"$f":"IF(ISNA(VLOOKUP($K9,'E23'!$B$3:$G$22,5,FALSE)),\"\",VLOOKUP($K9,'E23'!$B$3:$G$22,5,FALSE))","v":""},{"$f":"IF(ISNA((VLOOKUP($K9,'E23'!$B$3:$G$22,6,FALSE))),\"\",IF(ISBLANK(VLOOKUP($K9,'E23'!$B$3:$G$22,6,FALSE)),\"\",VLOOKUP($K9,'E23'!$B$3:$G$22,6,FALSE)))","v":""},{"$f":"IF(ISNA(VLOOKUP($K9,'E24'!$B$3:$G$22,5,FALSE)),\"\",VLOOKUP($K9,'E24'!$B$3:$G$22,5,FALSE))","v":""},{"$f":"IF(ISNA((VLOOKUP($K9,'E24'!$B$3:$G$22,6,FALSE))),\"\",IF(ISBLANK(VLOOKUP($K9,'E24'!$B$3:$G$22,6,FALSE)),\"\",VLOOKUP($K9,'E24'!$B$3:$G$22,6,FALSE)))","v":""},{"$f":"IF(ISNA(VLOOKUP($K9,'E25'!$B$3:$G$22,5,FALSE)),\"\",VLOOKUP($K9,'E25'!$B$3:$G$22,5,FALSE))","v":""},{"$f":"IF(ISNA((VLOOKUP($K9,'E25'!$B$3:$G$22,6,FALSE))),\"\",IF(ISBLANK(VLOOKUP($K9,'E25'!$B$3:$G$22,6,FALSE)),\"\",VLOOKUP($K9,'E25'!$B$3:$G$22,6,FALSE)))","v":""},{"$f":"IF(ISNA(VLOOKUP($K9,'E26'!$B$3:$G$22,5,FALSE)),\"\",VLOOKUP($K9,'E26'!$B$3:$G$22,5,FALSE))","v":""},{"$f":"IF(ISNA((VLOOKUP($K9,'E26'!$B$3:$G$22,6,FALSE))),\"\",IF(ISBLANK(VLOOKUP($K9,'E26'!$B$3:$G$22,6,FALSE)),\"\",VLOOKUP($K9,'E26'!$B$3:$G$22,6,FALSE)))","v":""},{"$f":"IF(ISNA(VLOOKUP($K9,'E27'!$B$3:$G$22,5,FALSE)),\"\",VLOOKUP($K9,'E27'!$B$3:$G$22,5,FALSE))","v":""},{"$f":"IF(ISNA((VLOOKUP($K9,'E27'!$B$3:$G$22,6,FALSE))),\"\",IF(ISBLANK(VLOOKUP($K9,'E27'!$B$3:$G$22,6,FALSE)),\"\",VLOOKUP($K9,'E27'!$B$3:$G$22,6,FALSE)))","v":""},{"$f":"IF(ISNA(VLOOKUP($K9,'E28'!$B$3:$G$22,5,FALSE)),\"\",VLOOKUP($K9,'E28'!$B$3:$G$22,5,FALSE))","v":""},{"$f":"IF(ISNA((VLOOKUP($K9,'E28'!$B$3:$G$22,6,FALSE))),\"\",IF(ISBLANK(VLOOKUP($K9,'E28'!$B$3:$G$22,6,FALSE)),\"\",VLOOKUP($K9,'E28'!$B$3:$G$22,6,FALSE)))","v":""},{"$f":"IF(ISNA(VLOOKUP($K9,'E29'!$B$3:$G$22,5,FALSE)),\"\",VLOOKUP($K9,'E29'!$B$3:$G$22,5,FALSE))","v":""},{"$f":"IF(ISNA((VLOOKUP($K9,'E29'!$B$3:$G$22,6,FALSE))),\"\",IF(ISBLANK(VLOOKUP($K9,'E29'!$B$3:$G$22,6,FALSE)),\"\",VLOOKUP($K9,'E29'!$B$3:$G$22,6,FALSE)))","v":""},{"$f":"IF(ISNA(VLOOKUP($K9,'E30'!$B$3:$G$22,5,FALSE)),\"\",VLOOKUP($K9,'E30'!$B$3:$G$22,5,FALSE))","v":""},{"$f":"IF(ISNA((VLOOKUP($K9,'E30'!$B$3:$G$22,6,FALSE))),\"\",IF(ISBLANK(VLOOKUP($K9,'E30'!$B$3:$G$22,6,FALSE)),\"\",VLOOKUP($K9,'E30'!$B$3:$G$22,6,FALSE)))","v":""}]
["E6",{"$f":"CONCATENATE('Liste classe'!E8,\" \",'Liste classe'!F8,\" \",'Liste classe'!G8,\" \",'Liste classe'!H8,\" \",'Liste classe'!I8,\" \",'Liste classe'!J8)","v":"     "},{"$f":"'E6'!$F$24","v":"00:00:00"},{"$f":"'E6'!$F$26","v":" "},{"$f":"'E6'!$G$28","v":0},{"$f":"'E6'!$I$28","v":0},{"$f":"COUNTA('E6'!$D$3:$D$22)","v":0},null,null,null,{"$f":"IF(ISBLANK(Circuits!B5),\"\",Circuits!B5)","v":""},{"$f":"IF(ISBLANK(Circuits!C5),\"\",Circuits!C5)","v":""},"",{"$f":"IF(ISERROR(AVERAGE(P10,R10,T10,V10,X10,Z10,AB10,AD10,AF10,AH10,AJ10,AL10,AN10,AP10,AR10,AT10,AV10,AX10,AZ10,BB10,BD10,BF10,BH10,BJ10,BL10,BN10,BP10,BR10,BT10,BV10)),\"\",AVERAGE(P10,R10,T10,V10,X10,Z10,AB10,AD10,AF10,AH10,AJ10,AL10,AN10,AP10,AR10,AT10,AV10,AX10,AZ10,BB10,BD10,BF10,BH10,BJ10,BL10,BN10,BP10,BR10,BT10,BV10))","v":""},{"$f":"IF(ISNA(VLOOKUP($K10,'E1'!$B$3:$G$22,5,FALSE)),\"\",VLOOKUP($K10,'E1'!$B$3:$G$22,5,FALSE))","v":""},{"$f":"IF(ISNA((VLOOKUP($K10,'E1'!$B$3:$G$22,6,FALSE))),\"\",IF(ISBLANK(VLOOKUP($K10,'E1'!$B$3:$G$22,6,FALSE)),\"\",VLOOKUP($K10,'E1'!$B$3:$G$22,6,FALSE)))","v":""},{"$f":"IF(ISNA(VLOOKUP($K10,'E2'!$B$3:$G$22,5,FALSE)),\"\",VLOOKUP($K10,'E2'!$B$3:$G$22,5,FALSE))","v":""},{"$f":"IF(ISNA((VLOOKUP($K10,'E2'!$B$3:$G$22,6,FALSE))),\"\",IF(ISBLANK(VLOOKUP($K10,'E2'!$B$3:$G$22,6,FALSE)),\"\",VLOOKUP($K10,'E2'!$B$3:$G$22,6,FALSE)))","v":""},{"$f":"IF(ISNA(VLOOKUP($K10,'E3'!$B$3:$G$22,5,FALSE)),\"\",VLOOKUP($K10,'E3'!$B$3:$G$22,5,FALSE))","v":""},{"$f":"IF(ISNA((VLOOKUP($K10,'E3'!$B$3:$G$22,6,FALSE))),\"\",IF(ISBLANK(VLOOKUP($K10,'E3'!$B$3:$G$22,6,FALSE)),\"\",VLOOKUP($K10,'E3'!$B$3:$G$22,6,FALSE)))","v":""},{"$f":"IF(ISNA(VLOOKUP($K10,'E4'!$B$3:$G$22,5,FALSE)),\"\",VLOOKUP($K10,'E4'!$B$3:$G$22,5,FALSE))","v":""},{"$f":"IF(ISNA((VLOOKUP($K10,'E4'!$B$3:$G$22,6,FALSE))),\"\",IF(ISBLANK(VLOOKUP($K10,'E4'!$B$3:$G$22,6,FALSE)),\"\",VLOOKUP($K10,'E4'!$B$3:$G$22,6,FALSE)))","v":""},{"$f":"IF(ISNA(VLOOKUP($K10,'E5'!$B$3:$G$22,5,FALSE)),\"\",VLOOKUP($K10,'E5'!$B$3:$G$22,5,FALSE))","v":""},{"$f":"IF(ISNA((VLOOKUP($K10,'E5'!$B$3:$G$22,6,FALSE))),\"\",IF(ISBLANK(VLOOKUP($K10,'E5'!$B$3:$G$22,6,FALSE)),\"\",VLOOKUP($K10,'E5'!$B$3:$G$22,6,FALSE)))","v":""},{"$f":"IF(ISNA(VLOOKUP($K10,'E6'!$B$3:$G$22,5,FALSE)),\"\",VLOOKUP($K10,'E6'!$B$3:$G$22,5,FALSE))","v":""},{"$f":"IF(ISNA((VLOOKUP($K10,'E6'!$B$3:$G$22,6,FALSE))),\"\",IF(ISBLANK(VLOOKUP($K10,'E6'!$B$3:$G$22,6,FALSE)),\"\",VLOOKUP($K10,'E6'!$B$3:$G$22,6,FALSE)))","v":""},{"$f":"IF(ISNA(VLOOKUP($K10,'E7'!$B$3:$G$22,5,FALSE)),\"\",VLOOKUP($K10,'E7'!$B$3:$G$22,5,FALSE))","v":""},{"$f":"IF(ISNA((VLOOKUP($K10,'E7'!$B$3:$G$22,6,FALSE))),\"\",IF(ISBLANK(VLOOKUP($K10,'E7'!$B$3:$G$22,6,FALSE)),\"\",VLOOKUP($K10,'E7'!$B$3:$G$22,6,FALSE)))","v":""},{"$f":"IF(ISNA(VLOOKUP($K10,'E8'!$B$3:$G$22,5,FALSE)),\"\",VLOOKUP($K10,'E8'!$B$3:$G$22,5,FALSE))","v":""},{"$f":"IF(ISNA((VLOOKUP($K10,'E8'!$B$3:$G$22,6,FALSE))),\"\",IF(ISBLANK(VLOOKUP($K10,'E8'!$B$3:$G$22,6,FALSE)),\"\",VLOOKUP($K10,'E8'!$B$3:$G$22,6,FALSE)))","v":""},{"$f":"IF(ISNA(VLOOKUP($K10,'E9'!$B$3:$G$22,5,FALSE)),\"\",VLOOKUP($K10,'E9'!$B$3:$G$22,5,FALSE))","v":""},{"$f":"IF(ISNA((VLOOKUP($K10,'E9'!$B$3:$G$22,6,FALSE))),\"\",IF(ISBLANK(VLOOKUP($K10,'E9'!$B$3:$G$22,6,FALSE)),\"\",VLOOKUP($K10,'E9'!$B$3:$G$22,6,FALSE)))","v":""},{"$f":"IF(ISNA(VLOOKUP($K10,'E10'!$B$3:$G$22,5,FALSE)),\"\",VLOOKUP($K10,'E10'!$B$3:$G$22,5,FALSE))","v":""},{"$f":"IF(ISNA((VLOOKUP($K10,'E10'!$B$3:$G$22,6,FALSE))),\"\",IF(ISBLANK(VLOOKUP($K10,'E10'!$B$3:$G$22,6,FALSE)),\"\",VLOOKUP($K10,'E10'!$B$3:$G$22,6,FALSE)))","v":""},{"$f":"IF(ISNA(VLOOKUP($K10,'E11'!$B$3:$G$22,5,FALSE)),\"\",VLOOKUP($K10,'E11'!$B$3:$G$22,5,FALSE))","v":""},{"$f":"IF(ISNA((VLOOKUP($K10,'E11'!$B$3:$G$22,6,FALSE))),\"\",IF(ISBLANK(VLOOKUP($K10,'E11'!$B$3:$G$22,6,FALSE)),\"\",VLOOKUP($K10,'E11'!$B$3:$G$22,6,FALSE)))","v":""},{"$f":"IF(ISNA(VLOOKUP($K10,'E12'!$B$3:$G$22,5,FALSE)),\"\",VLOOKUP($K10,'E12'!$B$3:$G$22,5,FALSE))","v":""},{"$f":"IF(ISNA((VLOOKUP($K10,'E12'!$B$3:$G$22,6,FALSE))),\"\",IF(ISBLANK(VLOOKUP($K10,'E12'!$B$3:$G$22,6,FALSE)),\"\",VLOOKUP($K10,'E12'!$B$3:$G$22,6,FALSE)))","v":""},{"$f":"IF(ISNA(VLOOKUP($K10,'E13'!$B$3:$G$22,5,FALSE)),\"\",VLOOKUP($K10,'E13'!$B$3:$G$22,5,FALSE))","v":""},{"$f":"IF(ISNA((VLOOKUP($K10,'E13'!$B$3:$G$22,6,FALSE))),\"\",IF(ISBLANK(VLOOKUP($K10,'E13'!$B$3:$G$22,6,FALSE)),\"\",VLOOKUP($K10,'E13'!$B$3:$G$22,6,FALSE)))","v":""},{"$f":"IF(ISNA(VLOOKUP($K10,'E14'!$B$3:$G$22,5,FALSE)),\"\",VLOOKUP($K10,'E14'!$B$3:$G$22,5,FALSE))","v":""},{"$f":"IF(ISNA((VLOOKUP($K10,'E14'!$B$3:$G$22,6,FALSE))),\"\",IF(ISBLANK(VLOOKUP($K10,'E14'!$B$3:$G$22,6,FALSE)),\"\",VLOOKUP($K10,'E14'!$B$3:$G$22,6,FALSE)))","v":""},{"$f":"IF(ISNA(VLOOKUP($K10,'E15'!$B$3:$G$22,5,FALSE)),\"\",VLOOKUP($K10,'E15'!$B$3:$G$22,5,FALSE))","v":""},{"$f":"IF(ISNA((VLOOKUP($K10,'E15'!$B$3:$G$22,6,FALSE))),\"\",IF(VLOOKUP($K10,'E15'!$B$3:$G$22,6,FALSE)=0,\"\",VLOOKUP($K10,'E15'!$B$3:$G$22,6,FALSE)))","v":""},{"$f":"IF(ISNA(VLOOKUP($K10,'E16'!$B$3:$G$22,5,FALSE)),\"\",VLOOKUP($K10,'E16'!$B$3:$G$22,5,FALSE))","v":""},{"$f":"IF(ISNA((VLOOKUP($K10,'E16'!$B$3:$G$22,6,FALSE))),\"\",IF(ISBLANK(VLOOKUP($K10,'E16'!$B$3:$G$22,6,FALSE)),\"\",VLOOKUP($K10,'E16'!$B$3:$G$22,6,FALSE)))","v":""},{"$f":"IF(ISNA(VLOOKUP($K10,'E17'!$B$3:$G$22,5,FALSE)),\"\",VLOOKUP($K10,'E17'!$B$3:$G$22,5,FALSE))","v":""},{"$f":"IF(ISNA((VLOOKUP($K10,'E17'!$B$3:$G$22,6,FALSE))),\"\",IF(ISBLANK(VLOOKUP($K10,'E17'!$B$3:$G$22,6,FALSE)),\"\",VLOOKUP($K10,'E17'!$B$3:$G$22,6,FALSE)))","v":""},{"$f":"IF(ISNA(VLOOKUP($K10,'E18'!$B$3:$G$22,5,FALSE)),\"\",VLOOKUP($K10,'E18'!$B$3:$G$22,5,FALSE))","v":""},{"$f":"IF(ISNA((VLOOKUP($K10,'E18'!$B$3:$G$22,6,FALSE))),\"\",IF(ISBLANK(VLOOKUP($K10,'E18'!$B$3:$G$22,6,FALSE)),\"\",VLOOKUP($K10,'E18'!$B$3:$G$22,6,FALSE)))","v":""},{"$f":"IF(ISNA(VLOOKUP($K10,'E19'!$B$3:$G$22,5,FALSE)),\"\",VLOOKUP($K10,'E19'!$B$3:$G$22,5,FALSE))","v":""},{"$f":"IF(ISNA((VLOOKUP($K10,'E19'!$B$3:$G$22,6,FALSE))),\"\",IF(ISBLANK(VLOOKUP($K10,'E19'!$B$3:$G$22,6,FALSE)),\"\",VLOOKUP($K10,'E19'!$B$3:$G$22,6,FALSE)))","v":""},{"$f":"IF(ISNA(VLOOKUP($K10,'E20'!$B$3:$G$22,5,FALSE)),\"\",VLOOKUP($K10,'E20'!$B$3:$G$22,5,FALSE))","v":""},{"$f":"IF(ISNA((VLOOKUP($K10,'E20'!$B$3:$G$22,6,FALSE))),\"\",IF(ISBLANK(VLOOKUP($K10,'E20'!$B$3:$G$22,6,FALSE)),\"\",VLOOKUP($K10,'E20'!$B$3:$G$22,6,FALSE)))","v":""},{"$f":"IF(ISNA(VLOOKUP($K10,'E21'!$B$3:$G$22,5,FALSE)),\"\",VLOOKUP($K10,'E21'!$B$3:$G$22,5,FALSE))","v":""},{"$f":"IF(ISNA((VLOOKUP($K10,'E21'!$B$3:$G$22,6,FALSE))),\"\",IF(ISBLANK(VLOOKUP($K10,'E21'!$B$3:$G$22,6,FALSE)),\"\",VLOOKUP($K10,'E21'!$B$3:$G$22,6,FALSE)))","v":""},{"$f":"IF(ISNA(VLOOKUP($K10,'E22'!$B$3:$G$22,5,FALSE)),\"\",VLOOKUP($K10,'E22'!$B$3:$G$22,5,FALSE))","v":""},{"$f":"IF(ISNA((VLOOKUP($K10,'E22'!$B$3:$G$22,6,FALSE))),\"\",IF(ISBLANK(VLOOKUP($K10,'E22'!$B$3:$G$22,6,FALSE)),\"\",VLOOKUP($K10,'E22'!$B$3:$G$22,6,FALSE)))","v":""},{"$f":"IF(ISNA(VLOOKUP($K10,'E23'!$B$3:$G$22,5,FALSE)),\"\",VLOOKUP($K10,'E23'!$B$3:$G$22,5,FALSE))","v":""},{"$f":"IF(ISNA((VLOOKUP($K10,'E23'!$B$3:$G$22,6,FALSE))),\"\",IF(ISBLANK(VLOOKUP($K10,'E23'!$B$3:$G$22,6,FALSE)),\"\",VLOOKUP($K10,'E23'!$B$3:$G$22,6,FALSE)))","v":""},{"$f":"IF(ISNA(VLOOKUP($K10,'E24'!$B$3:$G$22,5,FALSE)),\"\",VLOOKUP($K10,'E24'!$B$3:$G$22,5,FALSE))","v":""},{"$f":"IF(ISNA((VLOOKUP($K10,'E24'!$B$3:$G$22,6,FALSE))),\"\",IF(ISBLANK(VLOOKUP($K10,'E24'!$B$3:$G$22,6,FALSE)),\"\",VLOOKUP($K10,'E24'!$B$3:$G$22,6,FALSE)))","v":""},{"$f":"IF(ISNA(VLOOKUP($K10,'E25'!$B$3:$G$22,5,FALSE)),\"\",VLOOKUP($K10,'E25'!$B$3:$G$22,5,FALSE))","v":""},{"$f":"IF(ISNA((VLOOKUP($K10,'E25'!$B$3:$G$22,6,FALSE))),\"\",IF(ISBLANK(VLOOKUP($K10,'E25'!$B$3:$G$22,6,FALSE)),\"\",VLOOKUP($K10,'E25'!$B$3:$G$22,6,FALSE)))","v":""},{"$f":"IF(ISNA(VLOOKUP($K10,'E26'!$B$3:$G$22,5,FALSE)),\"\",VLOOKUP($K10,'E26'!$B$3:$G$22,5,FALSE))","v":""},{"$f":"IF(ISNA((VLOOKUP($K10,'E26'!$B$3:$G$22,6,FALSE))),\"\",IF(ISBLANK(VLOOKUP($K10,'E26'!$B$3:$G$22,6,FALSE)),\"\",VLOOKUP($K10,'E26'!$B$3:$G$22,6,FALSE)))","v":""},{"$f":"IF(ISNA(VLOOKUP($K10,'E27'!$B$3:$G$22,5,FALSE)),\"\",VLOOKUP($K10,'E27'!$B$3:$G$22,5,FALSE))","v":""},{"$f":"IF(ISNA((VLOOKUP($K10,'E27'!$B$3:$G$22,6,FALSE))),\"\",IF(ISBLANK(VLOOKUP($K10,'E27'!$B$3:$G$22,6,FALSE)),\"\",VLOOKUP($K10,'E27'!$B$3:$G$22,6,FALSE)))","v":""},{"$f":"IF(ISNA(VLOOKUP($K10,'E28'!$B$3:$G$22,5,FALSE)),\"\",VLOOKUP($K10,'E28'!$B$3:$G$22,5,FALSE))","v":""},{"$f":"IF(ISNA((VLOOKUP($K10,'E28'!$B$3:$G$22,6,FALSE))),\"\",IF(ISBLANK(VLOOKUP($K10,'E28'!$B$3:$G$22,6,FALSE)),\"\",VLOOKUP($K10,'E28'!$B$3:$G$22,6,FALSE)))","v":""},{"$f":"IF(ISNA(VLOOKUP($K10,'E29'!$B$3:$G$22,5,FALSE)),\"\",VLOOKUP($K10,'E29'!$B$3:$G$22,5,FALSE))","v":""},{"$f":"IF(ISNA((VLOOKUP($K10,'E29'!$B$3:$G$22,6,FALSE))),\"\",IF(ISBLANK(VLOOKUP($K10,'E29'!$B$3:$G$22,6,FALSE)),\"\",VLOOKUP($K10,'E29'!$B$3:$G$22,6,FALSE)))","v":""},{"$f":"IF(ISNA(VLOOKUP($K10,'E30'!$B$3:$G$22,5,FALSE)),\"\",VLOOKUP($K10,'E30'!$B$3:$G$22,5,FALSE))","v":""},{"$f":"IF(ISNA((VLOOKUP($K10,'E30'!$B$3:$G$22,6,FALSE))),\"\",IF(ISBLANK(VLOOKUP($K10,'E30'!$B$3:$G$22,6,FALSE)),\"\",VLOOKUP($K10,'E30'!$B$3:$G$22,6,FALSE)))","v":""}]
["E7",{"$f":"CONCATENATE('Liste classe'!E9,\" \",'Liste classe'!F9,\" \",'Liste classe'!G9,\" \",'Liste classe'!H9,\" \",'Liste classe'!I9,\" \",'Liste classe'!J9)","v":"     "},{"$f":"'E7'!$F$24","v":"00:00:00"},{"$f":"'E7'!$F$26","v":" "},{"$f":"'E7'!$G$28","v":0},{"$f":"'E7'!$I$28","v":0},{"$f":"COUNTA('E7'!$D$3:$D$22)","v":0},null,null,null,{"$f":"IF(ISBLANK(Circuits!B6),\"\",Circuits!B6)","v":""},{"$f":"IF(ISBLANK(Circuits!C6),\"\",Circuits!C6)","v":""},"","",{"$f":"IF(ISNA(VLOOKUP($K11,'E1'!$B$3:$G$22,5,FALSE)),\"\",VLOOKUP($K11,'E1'!$B$3:$G$22,5,FALSE))","v":""},{"$f":"IF(ISNA((VLOOKUP($K11,'E1'!$B$3:$G$22,6,FALSE))),\"\",IF(ISBLANK(VLOOKUP($K11,'E1'!$B$3:$G$22,6,FALSE)),\"\",VLOOKUP($K11,'E1'!$B$3:$G$22,6,FALSE)))","v":""},{"$f":"IF(ISNA(VLOOKUP($K11,'E2'!$B$3:$G$22,5,FALSE)),\"\",VLOOKUP($K11,'E2'!$B$3:$G$22,5,FALSE))","v":""},{"$f":"IF(ISNA((VLOOKUP($K11,'E2'!$B$3:$G$22,6,FALSE))),\"\",IF(ISBLANK(VLOOKUP($K11,'E2'!$B$3:$G$22,6,FALSE)),\"\",VLOOKUP($K11,'E2'!$B$3:$G$22,6,FALSE)))","v":""},{"$f":"IF(ISNA(VLOOKUP($K11,'E3'!$B$3:$G$22,5,FALSE)),\"\",VLOOKUP($K11,'E3'!$B$3:$G$22,5,FALSE))","v":""},{"$f":"IF(ISNA((VLOOKUP($K11,'E3'!$B$3:$G$22,6,FALSE))),\"\",IF(ISBLANK(VLOOKUP($K11,'E3'!$B$3:$G$22,6,FALSE)),\"\",VLOOKUP($K11,'E3'!$B$3:$G$22,6,FALSE)))","v":""},{"$f":"IF(ISNA(VLOOKUP($K11,'E4'!$B$3:$G$22,5,FALSE)),\"\",VLOOKUP($K11,'E4'!$B$3:$G$22,5,FALSE))","v":""},{"$f":"IF(ISNA((VLOOKUP($K11,'E4'!$B$3:$G$22,6,FALSE))),\"\",IF(ISBLANK(VLOOKUP($K11,'E4'!$B$3:$G$22,6,FALSE)),\"\",VLOOKUP($K11,'E4'!$B$3:$G$22,6,FALSE)))","v":""},{"$f":"IF(ISNA(VLOOKUP($K11,'E5'!$B$3:$G$22,5,FALSE)),\"\",VLOOKUP($K11,'E5'!$B$3:$G$22,5,FALSE))","v":""},{"$f":"IF(ISNA((VLOOKUP($K11,'E5'!$B$3:$G$22,6,FALSE))),\"\",IF(ISBLANK(VLOOKUP($K11,'E5'!$B$3:$G$22,6,FALSE)),\"\",VLOOKUP($K11,'E5'!$B$3:$G$22,6,FALSE)))","v":""},{"$f":"IF(ISNA(VLOOKUP($K11,'E6'!$B$3:$G$22,5,FALSE)),\"\",VLOOKUP($K11,'E6'!$B$3:$G$22,5,FALSE))","v":""},{"$f":"IF(ISNA((VLOOKUP($K11,'E6'!$B$3:$G$22,6,FALSE))),\"\",IF(ISBLANK(VLOOKUP($K11,'E6'!$B$3:$G$22,6,FALSE)),\"\",VLOOKUP($K11,'E6'!$B$3:$G$22,6,FALSE)))","v":""},{"$f":"IF(ISNA(VLOOKUP($K11,'E7'!$B$3:$G$22,5,FALSE)),\"\",VLOOKUP($K11,'E7'!$B$3:$G$22,5,FALSE))","v":""},{"$f":"IF(ISNA((VLOOKUP($K11,'E7'!$B$3:$G$22,6,FALSE))),\"\",IF(ISBLANK(VLOOKUP($K11,'E7'!$B$3:$G$22,6,FALSE)),\"\",VLOOKUP($K11,'E7'!$B$3:$G$22,6,FALSE)))","v":""},{"$f":"IF(ISNA(VLOOKUP($K11,'E8'!$B$3:$G$22,5,FALSE)),\"\",VLOOKUP($K11,'E8'!$B$3:$G$22,5,FALSE))","v":""},{"$f":"IF(ISNA((VLOOKUP($K11,'E8'!$B$3:$G$22,6,FALSE))),\"\",IF(ISBLANK(VLOOKUP($K11,'E8'!$B$3:$G$22,6,FALSE)),\"\",VLOOKUP($K11,'E8'!$B$3:$G$22,6,FALSE)))","v":""},{"$f":"IF(ISNA(VLOOKUP($K11,'E9'!$B$3:$G$22,5,FALSE)),\"\",VLOOKUP($K11,'E9'!$B$3:$G$22,5,FALSE))","v":""},{"$f":"IF(ISNA((VLOOKUP($K11,'E9'!$B$3:$G$22,6,FALSE))),\"\",IF(ISBLANK(VLOOKUP($K11,'E9'!$B$3:$G$22,6,FALSE)),\"\",VLOOKUP($K11,'E9'!$B$3:$G$22,6,FALSE)))","v":""},{"$f":"IF(ISNA(VLOOKUP($K11,'E10'!$B$3:$G$22,5,FALSE)),\"\",VLOOKUP($K11,'E10'!$B$3:$G$22,5,FALSE))","v":""},{"$f":"IF(ISNA((VLOOKUP($K11,'E10'!$B$3:$G$22,6,FALSE))),\"\",IF(ISBLANK(VLOOKUP($K11,'E10'!$B$3:$G$22,6,FALSE)),\"\",VLOOKUP($K11,'E10'!$B$3:$G$22,6,FALSE)))","v":""},{"$f":"IF(ISNA(VLOOKUP($K11,'E11'!$B$3:$G$22,5,FALSE)),\"\",VLOOKUP($K11,'E11'!$B$3:$G$22,5,FALSE))","v":""},{"$f":"IF(ISNA((VLOOKUP($K11,'E11'!$B$3:$G$22,6,FALSE))),\"\",IF(ISBLANK(VLOOKUP($K11,'E11'!$B$3:$G$22,6,FALSE)),\"\",VLOOKUP($K11,'E11'!$B$3:$G$22,6,FALSE)))","v":""},{"$f":"IF(ISNA(VLOOKUP($K11,'E12'!$B$3:$G$22,5,FALSE)),\"\",VLOOKUP($K11,'E12'!$B$3:$G$22,5,FALSE))","v":""},{"$f":"IF(ISNA((VLOOKUP($K11,'E12'!$B$3:$G$22,6,FALSE))),\"\",IF(ISBLANK(VLOOKUP($K11,'E12'!$B$3:$G$22,6,FALSE)),\"\",VLOOKUP($K11,'E12'!$B$3:$G$22,6,FALSE)))","v":""},{"$f":"IF(ISNA(VLOOKUP($K11,'E13'!$B$3:$G$22,5,FALSE)),\"\",VLOOKUP($K11,'E13'!$B$3:$G$22,5,FALSE))","v":""},{"$f":"IF(ISNA((VLOOKUP($K11,'E13'!$B$3:$G$22,6,FALSE))),\"\",IF(ISBLANK(VLOOKUP($K11,'E13'!$B$3:$G$22,6,FALSE)),\"\",VLOOKUP($K11,'E13'!$B$3:$G$22,6,FALSE)))","v":""},{"$f":"IF(ISNA(VLOOKUP($K11,'E14'!$B$3:$G$22,5,FALSE)),\"\",VLOOKUP($K11,'E14'!$B$3:$G$22,5,FALSE))","v":""},{"$f":"IF(ISNA((VLOOKUP($K11,'E14'!$B$3:$G$22,6,FALSE))),\"\",IF(ISBLANK(VLOOKUP($K11,'E14'!$B$3:$G$22,6,FALSE)),\"\",VLOOKUP($K11,'E14'!$B$3:$G$22,6,FALSE)))","v":""},{"$f":"IF(ISNA(VLOOKUP($K11,'E15'!$B$3:$G$22,5,FALSE)),\"\",VLOOKUP($K11,'E15'!$B$3:$G$22,5,FALSE))","v":""},{"$f":"IF(ISNA((VLOOKUP($K11,'E15'!$B$3:$G$22,6,FALSE))),\"\",IF(VLOOKUP($K11,'E15'!$B$3:$G$22,6,FALSE)=0,\"\",VLOOKUP($K11,'E15'!$B$3:$G$22,6,FALSE)))","v":""},{"$f":"IF(ISNA(VLOOKUP($K11,'E16'!$B$3:$G$22,5,FALSE)),\"\",VLOOKUP($K11,'E16'!$B$3:$G$22,5,FALSE))","v":""},{"$f":"IF(ISNA((VLOOKUP($K11,'E16'!$B$3:$G$22,6,FALSE))),\"\",IF(ISBLANK(VLOOKUP($K11,'E16'!$B$3:$G$22,6,FALSE)),\"\",VLOOKUP($K11,'E16'!$B$3:$G$22,6,FALSE)))","v":""},{"$f":"IF(ISNA(VLOOKUP($K11,'E17'!$B$3:$G$22,5,FALSE)),\"\",VLOOKUP($K11,'E17'!$B$3:$G$22,5,FALSE))","v":""},{"$f":"IF(ISNA((VLOOKUP($K11,'E17'!$B$3:$G$22,6,FALSE))),\"\",IF(ISBLANK(VLOOKUP($K11,'E17'!$B$3:$G$22,6,FALSE)),\"\",VLOOKUP($K11,'E17'!$B$3:$G$22,6,FALSE)))","v":""},{"$f":"IF(ISNA(VLOOKUP($K11,'E18'!$B$3:$G$22,5,FALSE)),\"\",VLOOKUP($K11,'E18'!$B$3:$G$22,5,FALSE))","v":""},{"$f":"IF(ISNA((VLOOKUP($K11,'E18'!$B$3:$G$22,6,FALSE))),\"\",IF(ISBLANK(VLOOKUP($K11,'E18'!$B$3:$G$22,6,FALSE)),\"\",VLOOKUP($K11,'E18'!$B$3:$G$22,6,FALSE)))","v":""},{"$f":"IF(ISNA(VLOOKUP($K11,'E19'!$B$3:$G$22,5,FALSE)),\"\",VLOOKUP($K11,'E19'!$B$3:$G$22,5,FALSE))","v":""},{"$f":"IF(ISNA((VLOOKUP($K11,'E19'!$B$3:$G$22,6,FALSE))),\"\",IF(ISBLANK(VLOOKUP($K11,'E19'!$B$3:$G$22,6,FALSE)),\"\",VLOOKUP($K11,'E19'!$B$3:$G$22,6,FALSE)))","v":""},{"$f":"IF(ISNA(VLOOKUP($K11,'E20'!$B$3:$G$22,5,FALSE)),\"\",VLOOKUP($K11,'E20'!$B$3:$G$22,5,FALSE))","v":""},{"$f":"IF(ISNA((VLOOKUP($K11,'E20'!$B$3:$G$22,6,FALSE))),\"\",IF(ISBLANK(VLOOKUP($K11,'E20'!$B$3:$G$22,6,FALSE)),\"\",VLOOKUP($K11,'E20'!$B$3:$G$22,6,FALSE)))","v":""},{"$f":"IF(ISNA(VLOOKUP($K11,'E21'!$B$3:$G$22,5,FALSE)),\"\",VLOOKUP($K11,'E21'!$B$3:$G$22,5,FALSE))","v":""},{"$f":"IF(ISNA((VLOOKUP($K11,'E21'!$B$3:$G$22,6,FALSE))),\"\",IF(ISBLANK(VLOOKUP($K11,'E21'!$B$3:$G$22,6,FALSE)),\"\",VLOOKUP($K11,'E21'!$B$3:$G$22,6,FALSE)))","v":""},{"$f":"IF(ISNA(VLOOKUP($K11,'E22'!$B$3:$G$22,5,FALSE)),\"\",VLOOKUP($K11,'E22'!$B$3:$G$22,5,FALSE))","v":""},{"$f":"IF(ISNA((VLOOKUP($K11,'E22'!$B$3:$G$22,6,FALSE))),\"\",IF(ISBLANK(VLOOKUP($K11,'E22'!$B$3:$G$22,6,FALSE)),\"\",VLOOKUP($K11,'E22'!$B$3:$G$22,6,FALSE)))","v":""},{"$f":"IF(ISNA(VLOOKUP($K11,'E23'!$B$3:$G$22,5,FALSE)),\"\",VLOOKUP($K11,'E23'!$B$3:$G$22,5,FALSE))","v":""},{"$f":"IF(ISNA((VLOOKUP($K11,'E23'!$B$3:$G$22,6,FALSE))),\"\",IF(ISBLANK(VLOOKUP($K11,'E23'!$B$3:$G$22,6,FALSE)),\"\",VLOOKUP($K11,'E23'!$B$3:$G$22,6,FALSE)))","v":""},{"$f":"IF(ISNA(VLOOKUP($K11,'E24'!$B$3:$G$22,5,FALSE)),\"\",VLOOKUP($K11,'E24'!$B$3:$G$22,5,FALSE))","v":""},{"$f":"IF(ISNA((VLOOKUP($K11,'E24'!$B$3:$G$22,6,FALSE))),\"\",IF(ISBLANK(VLOOKUP($K11,'E24'!$B$3:$G$22,6,FALSE)),\"\",VLOOKUP($K11,'E24'!$B$3:$G$22,6,FALSE)))","v":""},{"$f":"IF(ISNA(VLOOKUP($K11,'E25'!$B$3:$G$22,5,FALSE)),\"\",VLOOKUP($K11,'E25'!$B$3:$G$22,5,FALSE))","v":""},{"$f":"IF(ISNA((VLOOKUP($K11,'E25'!$B$3:$G$22,6,FALSE))),\"\",IF(ISBLANK(VLOOKUP($K11,'E25'!$B$3:$G$22,6,FALSE)),\"\",VLOOKUP($K11,'E25'!$B$3:$G$22,6,FALSE)))","v":""},{"$f":"IF(ISNA(VLOOKUP($K11,'E26'!$B$3:$G$22,5,FALSE)),\"\",VLOOKUP($K11,'E26'!$B$3:$G$22,5,FALSE))","v":""},{"$f":"IF(ISNA((VLOOKUP($K11,'E26'!$B$3:$G$22,6,FALSE))),\"\",IF(ISBLANK(VLOOKUP($K11,'E26'!$B$3:$G$22,6,FALSE)),\"\",VLOOKUP($K11,'E26'!$B$3:$G$22,6,FALSE)))","v":""},{"$f":"IF(ISNA(VLOOKUP($K11,'E27'!$B$3:$G$22,5,FALSE)),\"\",VLOOKUP($K11,'E27'!$B$3:$G$22,5,FALSE))","v":""},{"$f":"IF(ISNA((VLOOKUP($K11,'E27'!$B$3:$G$22,6,FALSE))),\"\",IF(ISBLANK(VLOOKUP($K11,'E27'!$B$3:$G$22,6,FALSE)),\"\",VLOOKUP($K11,'E27'!$B$3:$G$22,6,FALSE)))","v":""},{"$f":"IF(ISNA(VLOOKUP($K11,'E28'!$B$3:$G$22,5,FALSE)),\"\",VLOOKUP($K11,'E28'!$B$3:$G$22,5,FALSE))","v":""},{"$f":"IF(ISNA((VLOOKUP($K11,'E28'!$B$3:$G$22,6,FALSE))),\"\",IF(ISBLANK(VLOOKUP($K11,'E28'!$B$3:$G$22,6,FALSE)),\"\",VLOOKUP($K11,'E28'!$B$3:$G$22,6,FALSE)))","v":""},{"$f":"IF(ISNA(VLOOKUP($K11,'E29'!$B$3:$G$22,5,FALSE)),\"\",VLOOKUP($K11,'E29'!$B$3:$G$22,5,FALSE))","v":""},{"$f":"IF(ISNA((VLOOKUP($K11,'E29'!$B$3:$G$22,6,FALSE))),\"\",IF(ISBLANK(VLOOKUP($K11,'E29'!$B$3:$G$22,6,FALSE)),\"\",VLOOKUP($K11,'E29'!$B$3:$G$22,6,FALSE)))","v":""},{"$f":"IF(ISNA(VLOOKUP($K11,'E30'!$B$3:$G$22,5,FALSE)),\"\",VLOOKUP($K11,'E30'!$B$3:$G$22,5,FALSE))","v":""},{"$f":"IF(ISNA((VLOOKUP($K11,'E30'!$B$3:$G$22,6,FALSE))),\"\",IF(ISBLANK(VLOOKUP($K11,'E30'!$B$3:$G$22,6,FALSE)),\"\",VLOOKUP($K11,'E30'!$B$3:$G$22,6,FALSE)))","v":""}]
["E8",{"$f":"CONCATENATE('Liste classe'!E10,\" \",'Liste classe'!F10,\" \",'Liste classe'!G10,\" \",'Liste classe'!H10,\" \",'Liste classe'!I10,\" \",'Liste classe'!J10)","v":"     "},{"$f":"'E8'!$F$24","v":"00:00:00"},{"$f":"'E8'!$F$26","v":" "},{"$f":"'E8'!$G$28","v":0},{"$f":"'E8'!$I$28","v":0},{"$f":"COUNTA('E8'!$D$3:$D$22)","v":0},null,null,null,{"$f":"IF(ISBLANK(Circuits!B7),\"\",Circuits!B7)","v":""},{"$f":"IF(ISBLANK(Circuits!C7),\"\",Circuits!C7)","v":""},"","",{"$f":"IF(ISNA(VLOOKUP($K12,'E1'!$B$3:$G$22,5,FALSE)),\"\",VLOOKUP($K12,'E1'!$B$3:$G$22,5,FALSE))","v":""},{"$f":"IF(ISNA((VLOOKUP($K12,'E1'!$B$3:$G$22,6,FALSE))),\"\",IF(ISBLANK(VLOOKUP($K12,'E1'!$B$3:$G$22,6,FALSE)),\"\",VLOOKUP($K12,'E1'!$B$3:$G$22,6,FALSE)))","v":""},{"$f":"IF(ISNA(VLOOKUP($K12,'E2'!$B$3:$G$22,5,FALSE)),\"\",VLOOKUP($K12,'E2'!$B$3:$G$22,5,FALSE))","v":""},{"$f":"IF(ISNA((VLOOKUP($K12,'E2'!$B$3:$G$22,6,FALSE))),\"\",IF(ISBLANK(VLOOKUP($K12,'E2'!$B$3:$G$22,6,FALSE)),\"\",VLOOKUP($K12,'E2'!$B$3:$G$22,6,FALSE)))","v":""},{"$f":"IF(ISNA(VLOOKUP($K12,'E3'!$B$3:$G$22,5,FALSE)),\"\",VLOOKUP($K12,'E3'!$B$3:$G$22,5,FALSE))","v":""},{"$f":"IF(ISNA((VLOOKUP($K12,'E3'!$B$3:$G$22,6,FALSE))),\"\",IF(ISBLANK(VLOOKUP($K12,'E3'!$B$3:$G$22,6,FALSE)),\"\",VLOOKUP($K12,'E3'!$B$3:$G$22,6,FALSE)))","v":""},{"$f":"IF(ISNA(VLOOKUP($K12,'E4'!$B$3:$G$22,5,FALSE)),\"\",VLOOKUP($K12,'E4'!$B$3:$G$22,5,FALSE))","v":""},{"$f":"IF(ISNA((VLOOKUP($K12,'E4'!$B$3:$G$22,6,FALSE))),\"\",IF(ISBLANK(VLOOKUP($K12,'E4'!$B$3:$G$22,6,FALSE)),\"\",VLOOKUP($K12,'E4'!$B$3:$G$22,6,FALSE)))","v":""},{"$f":"IF(ISNA(VLOOKUP($K12,'E5'!$B$3:$G$22,5,FALSE)),\"\",VLOOKUP($K12,'E5'!$B$3:$G$22,5,FALSE))","v":""},{"$f":"IF(ISNA((VLOOKUP($K12,'E5'!$B$3:$G$22,6,FALSE))),\"\",IF(ISBLANK(VLOOKUP($K12,'E5'!$B$3:$G$22,6,FALSE)),\"\",VLOOKUP($K12,'E5'!$B$3:$G$22,6,FALSE)))","v":""},{"$f":"IF(ISNA(VLOOKUP($K12,'E6'!$B$3:$G$22,5,FALSE)),\"\",VLOOKUP($K12,'E6'!$B$3:$G$22,5,FALSE))","v":""},{"$f":"IF(ISNA((VLOOKUP($K12,'E6'!$B$3:$G$22,6,FALSE))),\"\",IF(ISBLANK(VLOOKUP($K12,'E6'!$B$3:$G$22,6,FALSE)),\"\",VLOOKUP($K12,'E6'!$B$3:$G$22,6,FALSE)))","v":""},{"$f":"IF(ISNA(VLOOKUP($K12,'E7'!$B$3:$G$22,5,FALSE)),\"\",VLOOKUP($K12,'E7'!$B$3:$G$22,5,FALSE))","v":""},{"$f":"IF(ISNA((VLOOKUP($K12,'E7'!$B$3:$G$22,6,FALSE))),\"\",IF(ISBLANK(VLOOKUP($K12,'E7'!$B$3:$G$22,6,FALSE)),\"\",VLOOKUP($K12,'E7'!$B$3:$G$22,6,FALSE)))","v":""},{"$f":"IF(ISNA(VLOOKUP($K12,'E8'!$B$3:$G$22,5,FALSE)),\"\",VLOOKUP($K12,'E8'!$B$3:$G$22,5,FALSE))","v":""},{"$f":"IF(ISNA((VLOOKUP($K12,'E8'!$B$3:$G$22,6,FALSE))),\"\",IF(ISBLANK(VLOOKUP($K12,'E8'!$B$3:$G$22,6,FALSE)),\"\",VLOOKUP($K12,'E8'!$B$3:$G$22,6,FALSE)))","v":""},{"$f":"IF(ISNA(VLOOKUP($K12,'E9'!$B$3:$G$22,5,FALSE)),\"\",VLOOKUP($K12,'E9'!$B$3:$G$22,5,FALSE))","v":""},{"$f":"IF(ISNA((VLOOKUP($K12,'E9'!$B$3:$G$22,6,FALSE))),\"\",IF(ISBLANK(VLOOKUP($K12,'E9'!$B$3:$G$22,6,FALSE)),\"\",VLOOKUP($K12,'E9'!$B$3:$G$22,6,FALSE)))","v":""},{"$f":"IF(ISNA(VLOOKUP($K12,'E10'!$B$3:$G$22,5,FALSE)),\"\",VLOOKUP($K12,'E10'!$B$3:$G$22,5,FALSE))","v":""},{"$f":"IF(ISNA((VLOOKUP($K12,'E10'!$B$3:$G$22,6,FALSE))),\"\",IF(ISBLANK(VLOOKUP($K12,'E10'!$B$3:$G$22,6,FALSE)),\"\",VLOOKUP($K12,'E10'!$B$3:$G$22,6,FALSE)))","v":""},{"$f":"IF(ISNA(VLOOKUP($K12,'E11'!$B$3:$G$22,5,FALSE)),\"\",VLOOKUP($K12,'E11'!$B$3:$G$22,5,FALSE))","v":""},{"$f":"IF(ISNA((VLOOKUP($K12,'E11'!$B$3:$G$22,6,FALSE))),\"\",IF(ISBLANK(VLOOKUP($K12,'E11'!$B$3:$G$22,6,FALSE)),\"\",VLOOKUP($K12,'E11'!$B$3:$G$22,6,FALSE)))","v":""},{"$f":"IF(ISNA(VLOOKUP($K12,'E12'!$B$3:$G$22,5,FALSE)),\"\",VLOOKUP($K12,'E12'!$B$3:$G$22,5,FALSE))","v":""},{"$f":"IF(ISNA((VLOOKUP($K12,'E12'!$B$3:$G$22,6,FALSE))),\"\",IF(ISBLANK(VLOOKUP($K12,'E12'!$B$3:$G$22,6,FALSE)),\"\",VLOOKUP($K12,'E12'!$B$3:$G$22,6,FALSE)))","v":""},{"$f":"IF(ISNA(VLOOKUP($K12,'E13'!$B$3:$G$22,5,FALSE)),\"\",VLOOKUP($K12,'E13'!$B$3:$G$22,5,FALSE))","v":""},{"$f":"IF(ISNA((VLOOKUP($K12,'E13'!$B$3:$G$22,6,FALSE))),\"\",IF(ISBLANK(VLOOKUP($K12,'E13'!$B$3:$G$22,6,FALSE)),\"\",VLOOKUP($K12,'E13'!$B$3:$G$22,6,FALSE)))","v":""},{"$f":"IF(ISNA(VLOOKUP($K12,'E14'!$B$3:$G$22,5,FALSE)),\"\",VLOOKUP($K12,'E14'!$B$3:$G$22,5,FALSE))","v":""},{"$f":"IF(ISNA((VLOOKUP($K12,'E14'!$B$3:$G$22,6,FALSE))),\"\",IF(ISBLANK(VLOOKUP($K12,'E14'!$B$3:$G$22,6,FALSE)),\"\",VLOOKUP($K12,'E14'!$B$3:$G$22,6,FALSE)))","v":""},{"$f":"IF(ISNA(VLOOKUP($K12,'E15'!$B$3:$G$22,5,FALSE)),\"\",VLOOKUP($K12,'E15'!$B$3:$G$22,5,FALSE))","v":""},{"$f":"IF(ISNA((VLOOKUP($K12,'E15'!$B$3:$G$22,6,FALSE))),\"\",IF(VLOOKUP($K12,'E15'!$B$3:$G$22,6,FALSE)=0,\"\",VLOOKUP($K12,'E15'!$B$3:$G$22,6,FALSE)))","v":""},{"$f":"IF(ISNA(VLOOKUP($K12,'E16'!$B$3:$G$22,5,FALSE)),\"\",VLOOKUP($K12,'E16'!$B$3:$G$22,5,FALSE))","v":""},{"$f":"IF(ISNA((VLOOKUP($K12,'E16'!$B$3:$G$22,6,FALSE))),\"\",IF(ISBLANK(VLOOKUP($K12,'E16'!$B$3:$G$22,6,FALSE)),\"\",VLOOKUP($K12,'E16'!$B$3:$G$22,6,FALSE)))","v":""},{"$f":"IF(ISNA(VLOOKUP($K12,'E17'!$B$3:$G$22,5,FALSE)),\"\",VLOOKUP($K12,'E17'!$B$3:$G$22,5,FALSE))","v":""},{"$f":"IF(ISNA((VLOOKUP($K12,'E17'!$B$3:$G$22,6,FALSE))),\"\",IF(ISBLANK(VLOOKUP($K12,'E17'!$B$3:$G$22,6,FALSE)),\"\",VLOOKUP($K12,'E17'!$B$3:$G$22,6,FALSE)))","v":""},{"$f":"IF(ISNA(VLOOKUP($K12,'E18'!$B$3:$G$22,5,FALSE)),\"\",VLOOKUP($K12,'E18'!$B$3:$G$22,5,FALSE))","v":""},{"$f":"IF(ISNA((VLOOKUP($K12,'E18'!$B$3:$G$22,6,FALSE))),\"\",IF(ISBLANK(VLOOKUP($K12,'E18'!$B$3:$G$22,6,FALSE)),\"\",VLOOKUP($K12,'E18'!$B$3:$G$22,6,FALSE)))","v":""},{"$f":"IF(ISNA(VLOOKUP($K12,'E19'!$B$3:$G$22,5,FALSE)),\"\",VLOOKUP($K12,'E19'!$B$3:$G$22,5,FALSE))","v":""},{"$f":"IF(ISNA((VLOOKUP($K12,'E19'!$B$3:$G$22,6,FALSE))),\"\",IF(ISBLANK(VLOOKUP($K12,'E19'!$B$3:$G$22,6,FALSE)),\"\",VLOOKUP($K12,'E19'!$B$3:$G$22,6,FALSE)))","v":""},{"$f":"IF(ISNA(VLOOKUP($K12,'E20'!$B$3:$G$22,5,FALSE)),\"\",VLOOKUP($K12,'E20'!$B$3:$G$22,5,FALSE))","v":""},{"$f":"IF(ISNA((VLOOKUP($K12,'E20'!$B$3:$G$22,6,FALSE))),\"\",IF(ISBLANK(VLOOKUP($K12,'E20'!$B$3:$G$22,6,FALSE)),\"\",VLOOKUP($K12,'E20'!$B$3:$G$22,6,FALSE)))","v":""},{"$f":"IF(ISNA(VLOOKUP($K12,'E21'!$B$3:$G$22,5,FALSE)),\"\",VLOOKUP($K12,'E21'!$B$3:$G$22,5,FALSE))","v":""},{"$f":"IF(ISNA((VLOOKUP($K12,'E21'!$B$3:$G$22,6,FALSE))),\"\",IF(ISBLANK(VLOOKUP($K12,'E21'!$B$3:$G$22,6,FALSE)),\"\",VLOOKUP($K12,'E21'!$B$3:$G$22,6,FALSE)))","v":""},{"$f":"IF(ISNA(VLOOKUP($K12,'E22'!$B$3:$G$22,5,FALSE)),\"\",VLOOKUP($K12,'E22'!$B$3:$G$22,5,FALSE))","v":""},{"$f":"IF(ISNA((VLOOKUP($K12,'E22'!$B$3:$G$22,6,FALSE))),\"\",IF(ISBLANK(VLOOKUP($K12,'E22'!$B$3:$G$22,6,FALSE)),\"\",VLOOKUP($K12,'E22'!$B$3:$G$22,6,FALSE)))","v":""},{"$f":"IF(ISNA(VLOOKUP($K12,'E23'!$B$3:$G$22,5,FALSE)),\"\",VLOOKUP($K12,'E23'!$B$3:$G$22,5,FALSE))","v":""},{"$f":"IF(ISNA((VLOOKUP($K12,'E23'!$B$3:$G$22,6,FALSE))),\"\",IF(ISBLANK(VLOOKUP($K12,'E23'!$B$3:$G$22,6,FALSE)),\"\",VLOOKUP($K12,'E23'!$B$3:$G$22,6,FALSE)))","v":""},{"$f":"IF(ISNA(VLOOKUP($K12,'E24'!$B$3:$G$22,5,FALSE)),\"\",VLOOKUP($K12,'E24'!$B$3:$G$22,5,FALSE))","v":""},{"$f":"IF(ISNA((VLOOKUP($K12,'E24'!$B$3:$G$22,6,FALSE))),\"\",IF(ISBLANK(VLOOKUP($K12,'E24'!$B$3:$G$22,6,FALSE)),\"\",VLOOKUP($K12,'E24'!$B$3:$G$22,6,FALSE)))","v":""},{"$f":"IF(ISNA(VLOOKUP($K12,'E25'!$B$3:$G$22,5,FALSE)),\"\",VLOOKUP($K12,'E25'!$B$3:$G$22,5,FALSE))","v":""},{"$f":"IF(ISNA((VLOOKUP($K12,'E25'!$B$3:$G$22,6,FALSE))),\"\",IF(ISBLANK(VLOOKUP($K12,'E25'!$B$3:$G$22,6,FALSE)),\"\",VLOOKUP($K12,'E25'!$B$3:$G$22,6,FALSE)))","v":""},{"$f":"IF(ISNA(VLOOKUP($K12,'E26'!$B$3:$G$22,5,FALSE)),\"\",VLOOKUP($K12,'E26'!$B$3:$G$22,5,FALSE))","v":""},{"$f":"IF(ISNA((VLOOKUP($K12,'E26'!$B$3:$G$22,6,FALSE))),\"\",IF(ISBLANK(VLOOKUP($K12,'E26'!$B$3:$G$22,6,FALSE)),\"\",VLOOKUP($K12,'E26'!$B$3:$G$22,6,FALSE)))","v":""},{"$f":"IF(ISNA(VLOOKUP($K12,'E27'!$B$3:$G$22,5,FALSE)),\"\",VLOOKUP($K12,'E27'!$B$3:$G$22,5,FALSE))","v":""},{"$f":"IF(ISNA((VLOOKUP($K12,'E27'!$B$3:$G$22,6,FALSE))),\"\",IF(ISBLANK(VLOOKUP($K12,'E27'!$B$3:$G$22,6,FALSE)),\"\",VLOOKUP($K12,'E27'!$B$3:$G$22,6,FALSE)))","v":""},{"$f":"IF(ISNA(VLOOKUP($K12,'E28'!$B$3:$G$22,5,FALSE)),\"\",VLOOKUP($K12,'E28'!$B$3:$G$22,5,FALSE))","v":""},{"$f":"IF(ISNA((VLOOKUP($K12,'E28'!$B$3:$G$22,6,FALSE))),\"\",IF(ISBLANK(VLOOKUP($K12,'E28'!$B$3:$G$22,6,FALSE)),\"\",VLOOKUP($K12,'E28'!$B$3:$G$22,6,FALSE)))","v":""},{"$f":"IF(ISNA(VLOOKUP($K12,'E29'!$B$3:$G$22,5,FALSE)),\"\",VLOOKUP($K12,'E29'!$B$3:$G$22,5,FALSE))","v":""},{"$f":"IF(ISNA((VLOOKUP($K12,'E29'!$B$3:$G$22,6,FALSE))),\"\",IF(ISBLANK(VLOOKUP($K12,'E29'!$B$3:$G$22,6,FALSE)),\"\",VLOOKUP($K12,'E29'!$B$3:$G$22,6,FALSE)))","v":""},{"$f":"IF(ISNA(VLOOKUP($K12,'E30'!$B$3:$G$22,5,FALSE)),\"\",VLOOKUP($K12,'E30'!$B$3:$G$22,5,FALSE))","v":""},{"$f":"IF(ISNA((VLOOKUP($K12,'E30'!$B$3:$G$22,6,FALSE))),\"\",IF(ISBLANK(VLOOKUP($K12,'E30'!$B$3:$G$22,6,FALSE)),\"\",VLOOKUP($K12,'E30'!$B$3:$G$22,6,FALSE)))","v":""}]
["E9",{"$f":"CONCATENATE('Liste classe'!E11,\" \",'Liste classe'!F11,\" \",'Liste classe'!G11,\" \",'Liste classe'!H11,\" \",'Liste classe'!I11,\" \",'Liste classe'!J11)","v":"     "},{"$f":"'E9'!$F$24","v":"00:00:00"},{"$f":"'E9'!$F$26","v":" "},{"$f":"'E9'!$G$28","v":0},{"$f":"'E9'!$I$28","v":0},{"$f":"COUNTA('E9'!$D$3:$D$22)","v":0},null,null,null,{"$f":"IF(ISBLANK(Circuits!B8),\"\",Circuits!B8)","v":""},{"$f":"IF(ISBLANK(Circuits!C8),\"\",Circuits!C8)","v":""},"","",{"$f":"IF(ISNA(VLOOKUP($K13,'E1'!$B$3:$G$22,5,FALSE)),\"\",VLOOKUP($K13,'E1'!$B$3:$G$22,5,FALSE))","v":""},{"$f":"IF(ISNA((VLOOKUP($K13,'E1'!$B$3:$G$22,6,FALSE))),\"\",IF(ISBLANK(VLOOKUP($K13,'E1'!$B$3:$G$22,6,FALSE)),\"\",VLOOKUP($K13,'E1'!$B$3:$G$22,6,FALSE)))","v":""},{"$f":"IF(ISNA(VLOOKUP($K13,'E2'!$B$3:$G$22,5,FALSE)),\"\",VLOOKUP($K13,'E2'!$B$3:$G$22,5,FALSE))","v":""},{"$f":"IF(ISNA((VLOOKUP($K13,'E2'!$B$3:$G$22,6,FALSE))),\"\",IF(ISBLANK(VLOOKUP($K13,'E2'!$B$3:$G$22,6,FALSE)),\"\",VLOOKUP($K13,'E2'!$B$3:$G$22,6,FALSE)))","v":""},{"$f":"IF(ISNA(VLOOKUP($K13,'E3'!$B$3:$G$22,5,FALSE)),\"\",VLOOKUP($K13,'E3'!$B$3:$G$22,5,FALSE))","v":""},{"$f":"IF(ISNA((VLOOKUP($K13,'E3'!$B$3:$G$22,6,FALSE))),\"\",IF(ISBLANK(VLOOKUP($K13,'E3'!$B$3:$G$22,6,FALSE)),\"\",VLOOKUP($K13,'E3'!$B$3:$G$22,6,FALSE)))","v":""},{"$f":"IF(ISNA(VLOOKUP($K13,'E4'!$B$3:$G$22,5,FALSE)),\"\",VLOOKUP($K13,'E4'!$B$3:$G$22,5,FALSE))","v":""},{"$f":"IF(ISNA((VLOOKUP($K13,'E4'!$B$3:$G$22,6,FALSE))),\"\",IF(ISBLANK(VLOOKUP($K13,'E4'!$B$3:$G$22,6,FALSE)),\"\",VLOOKUP($K13,'E4'!$B$3:$G$22,6,FALSE)))","v":""},{"$f":"IF(ISNA(VLOOKUP($K13,'E5'!$B$3:$G$22,5,FALSE)),\"\",VLOOKUP($K13,'E5'!$B$3:$G$22,5,FALSE))","v":""},{"$f":"IF(ISNA((VLOOKUP($K13,'E5'!$B$3:$G$22,6,FALSE))),\"\",IF(ISBLANK(VLOOKUP($K13,'E5'!$B$3:$G$22,6,FALSE)),\"\",VLOOKUP($K13,'E5'!$B$3:$G$22,6,FALSE)))","v":""},{"$f":"IF(ISNA(VLOOKUP($K13,'E6'!$B$3:$G$22,5,FALSE)),\"\",VLOOKUP($K13,'E6'!$B$3:$G$22,5,FALSE))","v":""},{"$f":"IF(ISNA((VLOOKUP($K13,'E6'!$B$3:$G$22,6,FALSE))),\"\",IF(ISBLANK(VLOOKUP($K13,'E6'!$B$3:$G$22,6,FALSE)),\"\",VLOOKUP($K13,'E6'!$B$3:$G$22,6,FALSE)))","v":""},{"$f":"IF(ISNA(VLOOKUP($K13,'E7'!$B$3:$G$22,5,FALSE)),\"\",VLOOKUP($K13,'E7'!$B$3:$G$22,5,FALSE))","v":""},{"$f":"IF(ISNA((VLOOKUP($K13,'E7'!$B$3:$G$22,6,FALSE))),\"\",IF(ISBLANK(VLOOKUP($K13,'E7'!$B$3:$G$22,6,FALSE)),\"\",VLOOKUP($K13,'E7'!$B$3:$G$22,6,FALSE)))","v":""},{"$f":"IF(ISNA(VLOOKUP($K13,'E8'!$B$3:$G$22,5,FALSE)),\"\",VLOOKUP($K13,'E8'!$B$3:$G$22,5,FALSE))","v":""},{"$f":"IF(ISNA((VLOOKUP($K13,'E8'!$B$3:$G$22,6,FALSE))),\"\",IF(ISBLANK(VLOOKUP($K13,'E8'!$B$3:$G$22,6,FALSE)),\"\",VLOOKUP($K13,'E8'!$B$3:$G$22,6,FALSE)))","v":""},{"$f":"IF(ISNA(VLOOKUP($K13,'E9'!$B$3:$G$22,5,FALSE)),\"\",VLOOKUP($K13,'E9'!$B$3:$G$22,5,FALSE))","v":""},{"$f":"IF(ISNA((VLOOKUP($K13,'E9'!$B$3:$G$22,6,FALSE))),\"\",IF(ISBLANK(VLOOKUP($K13,'E9'!$B$3:$G$22,6,FALSE)),\"\",VLOOKUP($K13,'E9'!$B$3:$G$22,6,FALSE)))","v":""},{"$f":"IF(ISNA(VLOOKUP($K13,'E10'!$B$3:$G$22,5,FALSE)),\"\",VLOOKUP($K13,'E10'!$B$3:$G$22,5,FALSE))","v":""},{"$f":"IF(ISNA((VLOOKUP($K13,'E10'!$B$3:$G$22,6,FALSE))),\"\",IF(ISBLANK(VLOOKUP($K13,'E10'!$B$3:$G$22,6,FALSE)),\"\",VLOOKUP($K13,'E10'!$B$3:$G$22,6,FALSE)))","v":""},{"$f":"IF(ISNA(VLOOKUP($K13,'E11'!$B$3:$G$22,5,FALSE)),\"\",VLOOKUP($K13,'E11'!$B$3:$G$22,5,FALSE))","v":""},{"$f":"IF(ISNA((VLOOKUP($K13,'E11'!$B$3:$G$22,6,FALSE))),\"\",IF(ISBLANK(VLOOKUP($K13,'E11'!$B$3:$G$22,6,FALSE)),\"\",VLOOKUP($K13,'E11'!$B$3:$G$22,6,FALSE)))","v":""},{"$f":"IF(ISNA(VLOOKUP($K13,'E12'!$B$3:$G$22,5,FALSE)),\"\",VLOOKUP($K13,'E12'!$B$3:$G$22,5,FALSE))","v":""},{"$f":"IF(ISNA((VLOOKUP($K13,'E12'!$B$3:$G$22,6,FALSE))),\"\",IF(ISBLANK(VLOOKUP($K13,'E12'!$B$3:$G$22,6,FALSE)),\"\",VLOOKUP($K13,'E12'!$B$3:$G$22,6,FALSE)))","v":""},{"$f":"IF(ISNA(VLOOKUP($K13,'E13'!$B$3:$G$22,5,FALSE)),\"\",VLOOKUP($K13,'E13'!$B$3:$G$22,5,FALSE))","v":""},{"$f":"IF(ISNA((VLOOKUP($K13,'E13'!$B$3:$G$22,6,FALSE))),\"\",IF(ISBLANK(VLOOKUP($K13,'E13'!$B$3:$G$22,6,FALSE)),\"\",VLOOKUP($K13,'E13'!$B$3:$G$22,6,FALSE)))","v":""},{"$f":"IF(ISNA(VLOOKUP($K13,'E14'!$B$3:$G$22,5,FALSE)),\"\",VLOOKUP($K13,'E14'!$B$3:$G$22,5,FALSE))","v":""},{"$f":"IF(ISNA((VLOOKUP($K13,'E14'!$B$3:$G$22,6,FALSE))),\"\",IF(ISBLANK(VLOOKUP($K13,'E14'!$B$3:$G$22,6,FALSE)),\"\",VLOOKUP($K13,'E14'!$B$3:$G$22,6,FALSE)))","v":""},{"$f":"IF(ISNA(VLOOKUP($K13,'E15'!$B$3:$G$22,5,FALSE)),\"\",VLOOKUP($K13,'E15'!$B$3:$G$22,5,FALSE))","v":""},{"$f":"IF(ISNA((VLOOKUP($K13,'E15'!$B$3:$G$22,6,FALSE))),\"\",IF(VLOOKUP($K13,'E15'!$B$3:$G$22,6,FALSE)=0,\"\",VLOOKUP($K13,'E15'!$B$3:$G$22,6,FALSE)))","v":""},{"$f":"IF(ISNA(VLOOKUP($K13,'E16'!$B$3:$G$22,5,FALSE)),\"\",VLOOKUP($K13,'E16'!$B$3:$G$22,5,FALSE))","v":""},{"$f":"IF(ISNA((VLOOKUP($K13,'E16'!$B$3:$G$22,6,FALSE))),\"\",IF(ISBLANK(VLOOKUP($K13,'E16'!$B$3:$G$22,6,FALSE)),\"\",VLOOKUP($K13,'E16'!$B$3:$G$22,6,FALSE)))","v":""},{"$f":"IF(ISNA(VLOOKUP($K13,'E17'!$B$3:$G$22,5,FALSE)),\"\",VLOOKUP($K13,'E17'!$B$3:$G$22,5,FALSE))","v":""},{"$f":"IF(ISNA((VLOOKUP($K13,'E17'!$B$3:$G$22,6,FALSE))),\"\",IF(ISBLANK(VLOOKUP($K13,'E17'!$B$3:$G$22,6,FALSE)),\"\",VLOOKUP($K13,'E17'!$B$3:$G$22,6,FALSE)))","v":""},{"$f":"IF(ISNA(VLOOKUP($K13,'E18'!$B$3:$G$22,5,FALSE)),\"\",VLOOKUP($K13,'E18'!$B$3:$G$22,5,FALSE))","v":""},{"$f":"IF(ISNA((VLOOKUP($K13,'E18'!$B$3:$G$22,6,FALSE))),\"\",IF(ISBLANK(VLOOKUP($K13,'E18'!$B$3:$G$22,6,FALSE)),\"\",VLOOKUP($K13,'E18'!$B$3:$G$22,6,FALSE)))","v":""},{"$f":"IF(ISNA(VLOOKUP($K13,'E19'!$B$3:$G$22,5,FALSE)),\"\",VLOOKUP($K13,'E19'!$B$3:$G$22,5,FALSE))","v":""},{"$f":"IF(ISNA((VLOOKUP($K13,'E19'!$B$3:$G$22,6,FALSE))),\"\",IF(ISBLANK(VLOOKUP($K13,'E19'!$B$3:$G$22,6,FALSE)),\"\",VLOOKUP($K13,'E19'!$B$3:$G$22,6,FALSE)))","v":""},{"$f":"IF(ISNA(VLOOKUP($K13,'E20'!$B$3:$G$22,5,FALSE)),\"\",VLOOKUP($K13,'E20'!$B$3:$G$22,5,FALSE))","v":""},{"$f":"IF(ISNA((VLOOKUP($K13,'E20'!$B$3:$G$22,6,FALSE))),\"\",IF(ISBLANK(VLOOKUP($K13,'E20'!$B$3:$G$22,6,FALSE)),\"\",VLOOKUP($K13,'E20'!$B$3:$G$22,6,FALSE)))","v":""},{"$f":"IF(ISNA(VLOOKUP($K13,'E21'!$B$3:$G$22,5,FALSE)),\"\",VLOOKUP($K13,'E21'!$B$3:$G$22,5,FALSE))","v":""},{"$f":"IF(ISNA((VLOOKUP($K13,'E21'!$B$3:$G$22,6,FALSE))),\"\",IF(ISBLANK(VLOOKUP($K13,'E21'!$B$3:$G$22,6,FALSE)),\"\",VLOOKUP($K13,'E21'!$B$3:$G$22,6,FALSE)))","v":""},{"$f":"IF(ISNA(VLOOKUP($K13,'E22'!$B$3:$G$22,5,FALSE)),\"\",VLOOKUP($K13,'E22'!$B$3:$G$22,5,FALSE))","v":""},{"$f":"IF(ISNA((VLOOKUP($K13,'E22'!$B$3:$G$22,6,FALSE))),\"\",IF(ISBLANK(VLOOKUP($K13,'E22'!$B$3:$G$22,6,FALSE)),\"\",VLOOKUP($K13,'E22'!$B$3:$G$22,6,FALSE)))","v":""},{"$f":"IF(ISNA(VLOOKUP($K13,'E23'!$B$3:$G$22,5,FALSE)),\"\",VLOOKUP($K13,'E23'!$B$3:$G$22,5,FALSE))","v":""},{"$f":"IF(ISNA((VLOOKUP($K13,'E23'!$B$3:$G$22,6,FALSE))),\"\",IF(ISBLANK(VLOOKUP($K13,'E23'!$B$3:$G$22,6,FALSE)),\"\",VLOOKUP($K13,'E23'!$B$3:$G$22,6,FALSE)))","v":""},{"$f":"IF(ISNA(VLOOKUP($K13,'E24'!$B$3:$G$22,5,FALSE)),\"\",VLOOKUP($K13,'E24'!$B$3:$G$22,5,FALSE))","v":""},{"$f":"IF(ISNA((VLOOKUP($K13,'E24'!$B$3:$G$22,6,FALSE))),\"\",IF(ISBLANK(VLOOKUP($K13,'E24'!$B$3:$G$22,6,FALSE)),\"\",VLOOKUP($K13,'E24'!$B$3:$G$22,6,FALSE)))","v":""},{"$f":"IF(ISNA(VLOOKUP($K13,'E25'!$B$3:$G$22,5,FALSE)),\"\",VLOOKUP($K13,'E25'!$B$3:$G$22,5,FALSE))","v":""},{"$f":"IF(ISNA((VLOOKUP($K13,'E25'!$B$3:$G$22,6,FALSE))),\"\",IF(ISBLANK(VLOOKUP($K13,'E25'!$B$3:$G$22,6,FALSE)),\"\",VLOOKUP($K13,'E25'!$B$3:$G$22,6,FALSE)))","v":""},{"$f":"IF(ISNA(VLOOKUP($K13,'E26'!$B$3:$G$22,5,FALSE)),\"\",VLOOKUP($K13,'E26'!$B$3:$G$22,5,FALSE))","v":""},{"$f":"IF(ISNA((VLOOKUP($K13,'E26'!$B$3:$G$22,6,FALSE))),\"\",IF(ISBLANK(VLOOKUP($K13,'E26'!$B$3:$G$22,6,FALSE)),\"\",VLOOKUP($K13,'E26'!$B$3:$G$22,6,FALSE)))","v":""},{"$f":"IF(ISNA(VLOOKUP($K13,'E27'!$B$3:$G$22,5,FALSE)),\"\",VLOOKUP($K13,'E27'!$B$3:$G$22,5,FALSE))","v":""},{"$f":"IF(ISNA((VLOOKUP($K13,'E27'!$B$3:$G$22,6,FALSE))),\"\",IF(ISBLANK(VLOOKUP($K13,'E27'!$B$3:$G$22,6,FALSE)),\"\",VLOOKUP($K13,'E27'!$B$3:$G$22,6,FALSE)))","v":""},{"$f":"IF(ISNA(VLOOKUP($K13,'E28'!$B$3:$G$22,5,FALSE)),\"\",VLOOKUP($K13,'E28'!$B$3:$G$22,5,FALSE))","v":""},{"$f":"IF(ISNA((VLOOKUP($K13,'E28'!$B$3:$G$22,6,FALSE))),\"\",IF(ISBLANK(VLOOKUP($K13,'E28'!$B$3:$G$22,6,FALSE)),\"\",VLOOKUP($K13,'E28'!$B$3:$G$22,6,FALSE)))","v":""},{"$f":"IF(ISNA(VLOOKUP($K13,'E29'!$B$3:$G$22,5,FALSE)),\"\",VLOOKUP($K13,'E29'!$B$3:$G$22,5,FALSE))","v":""},{"$f":"IF(ISNA((VLOOKUP($K13,'E29'!$B$3:$G$22,6,FALSE))),\"\",IF(ISBLANK(VLOOKUP($K13,'E29'!$B$3:$G$22,6,FALSE)),\"\",VLOOKUP($K13,'E29'!$B$3:$G$22,6,FALSE)))","v":""},{"$f":"IF(ISNA(VLOOKUP($K13,'E30'!$B$3:$G$22,5,FALSE)),\"\",VLOOKUP($K13,'E30'!$B$3:$G$22,5,FALSE))","v":""},{"$f":"IF(ISNA((VLOOKUP($K13,'E30'!$B$3:$G$22,6,FALSE))),\"\",IF(ISBLANK(VLOOKUP($K13,'E30'!$B$3:$G$22,6,FALSE)),\"\",VLOOKUP($K13,'E30'!$B$3:$G$22,6,FALSE)))","v":""}]
["E10",{"$f":"CONCATENATE('Liste classe'!E12,\" \",'Liste classe'!F12,\" \",'Liste classe'!G12,\" \",'Liste classe'!H12,\" \",'Liste classe'!I12,\" \",'Liste classe'!J12)","v":"     "},{"$f":"'E10'!$F$24","v":"00:00:00"},{"$f":"'E10'!$F$26","v":" "},{"$f":"'E10'!$G$28","v":0},{"$f":"'E10'!$I$28","v":0},{"$f":"COUNTA('E10'!$D$3:$D$22)","v":0},null,null,null,{"$f":"IF(ISBLANK(Circuits!B9),\"\",Circuits!B9)","v":""},{"$f":"IF(ISBLANK(Circuits!C9),\"\",Circuits!C9)","v":""},"","",{"$f":"IF(ISNA(VLOOKUP($K14,'E1'!$B$3:$G$22,5,FALSE)),\"\",VLOOKUP($K14,'E1'!$B$3:$G$22,5,FALSE))","v":""},{"$f":"IF(ISNA((VLOOKUP($K14,'E1'!$B$3:$G$22,6,FALSE))),\"\",IF(ISBLANK(VLOOKUP($K14,'E1'!$B$3:$G$22,6,FALSE)),\"\",VLOOKUP($K14,'E1'!$B$3:$G$22,6,FALSE)))","v":""},{"$f":"IF(ISNA(VLOOKUP($K14,'E2'!$B$3:$G$22,5,FALSE)),\"\",VLOOKUP($K14,'E2'!$B$3:$G$22,5,FALSE))","v":""},{"$f":"IF(ISNA((VLOOKUP($K14,'E2'!$B$3:$G$22,6,FALSE))),\"\",IF(ISBLANK(VLOOKUP($K14,'E2'!$B$3:$G$22,6,FALSE)),\"\",VLOOKUP($K14,'E2'!$B$3:$G$22,6,FALSE)))","v":""},{"$f":"IF(ISNA(VLOOKUP($K14,'E3'!$B$3:$G$22,5,FALSE)),\"\",VLOOKUP($K14,'E3'!$B$3:$G$22,5,FALSE))","v":""},{"$f":"IF(ISNA((VLOOKUP($K14,'E3'!$B$3:$G$22,6,FALSE))),\"\",IF(ISBLANK(VLOOKUP($K14,'E3'!$B$3:$G$22,6,FALSE)),\"\",VLOOKUP($K14,'E3'!$B$3:$G$22,6,FALSE)))","v":""},{"$f":"IF(ISNA(VLOOKUP($K14,'E4'!$B$3:$G$22,5,FALSE)),\"\",VLOOKUP($K14,'E4'!$B$3:$G$22,5,FALSE))","v":""},{"$f":"IF(ISNA((VLOOKUP($K14,'E4'!$B$3:$G$22,6,FALSE))),\"\",IF(ISBLANK(VLOOKUP($K14,'E4'!$B$3:$G$22,6,FALSE)),\"\",VLOOKUP($K14,'E4'!$B$3:$G$22,6,FALSE)))","v":""},{"$f":"IF(ISNA(VLOOKUP($K14,'E5'!$B$3:$G$22,5,FALSE)),\"\",VLOOKUP($K14,'E5'!$B$3:$G$22,5,FALSE))","v":""},{"$f":"IF(ISNA((VLOOKUP($K14,'E5'!$B$3:$G$22,6,FALSE))),\"\",IF(ISBLANK(VLOOKUP($K14,'E5'!$B$3:$G$22,6,FALSE)),\"\",VLOOKUP($K14,'E5'!$B$3:$G$22,6,FALSE)))","v":""},{"$f":"IF(ISNA(VLOOKUP($K14,'E6'!$B$3:$G$22,5,FALSE)),\"\",VLOOKUP($K14,'E6'!$B$3:$G$22,5,FALSE))","v":""},{"$f":"IF(ISNA((VLOOKUP($K14,'E6'!$B$3:$G$22,6,FALSE))),\"\",IF(ISBLANK(VLOOKUP($K14,'E6'!$B$3:$G$22,6,FALSE)),\"\",VLOOKUP($K14,'E6'!$B$3:$G$22,6,FALSE)))","v":""},{"$f":"IF(ISNA(VLOOKUP($K14,'E7'!$B$3:$G$22,5,FALSE)),\"\",VLOOKUP($K14,'E7'!$B$3:$G$22,5,FALSE))","v":""},{"$f":"IF(ISNA((VLOOKUP($K14,'E7'!$B$3:$G$22,6,FALSE))),\"\",IF(ISBLANK(VLOOKUP($K14,'E7'!$B$3:$G$22,6,FALSE)),\"\",VLOOKUP($K14,'E7'!$B$3:$G$22,6,FALSE)))","v":""},{"$f":"IF(ISNA(VLOOKUP($K14,'E8'!$B$3:$G$22,5,FALSE)),\"\",VLOOKUP($K14,'E8'!$B$3:$G$22,5,FALSE))","v":""},{"$f":"IF(ISNA((VLOOKUP($K14,'E8'!$B$3:$G$22,6,FALSE))),\"\",IF(ISBLANK(VLOOKUP($K14,'E8'!$B$3:$G$22,6,FALSE)),\"\",VLOOKUP($K14,'E8'!$B$3:$G$22,6,FALSE)))","v":""},{"$f":"IF(ISNA(VLOOKUP($K14,'E9'!$B$3:$G$22,5,FALSE)),\"\",VLOOKUP($K14,'E9'!$B$3:$G$22,5,FALSE))","v":""},{"$f":"IF(ISNA((VLOOKUP($K14,'E9'!$B$3:$G$22,6,FALSE))),\"\",IF(ISBLANK(VLOOKUP($K14,'E9'!$B$3:$G$22,6,FALSE)),\"\",VLOOKUP($K14,'E9'!$B$3:$G$22,6,FALSE)))","v":""},{"$f":"IF(ISNA(VLOOKUP($K14,'E10'!$B$3:$G$22,5,FALSE)),\"\",VLOOKUP($K14,'E10'!$B$3:$G$22,5,FALSE))","v":""},{"$f":"IF(ISNA((VLOOKUP($K14,'E10'!$B$3:$G$22,6,FALSE))),\"\",IF(ISBLANK(VLOOKUP($K14,'E10'!$B$3:$G$22,6,FALSE)),\"\",VLOOKUP($K14,'E10'!$B$3:$G$22,6,FALSE)))","v":""},{"$f":"IF(ISNA(VLOOKUP($K14,'E11'!$B$3:$G$22,5,FALSE)),\"\",VLOOKUP($K14,'E11'!$B$3:$G$22,5,FALSE))","v":""},{"$f":"IF(ISNA((VLOOKUP($K14,'E11'!$B$3:$G$22,6,FALSE))),\"\",IF(ISBLANK(VLOOKUP($K14,'E11'!$B$3:$G$22,6,FALSE)),\"\",VLOOKUP($K14,'E11'!$B$3:$G$22,6,FALSE)))","v":""},{"$f":"IF(ISNA(VLOOKUP($K14,'E12'!$B$3:$G$22,5,FALSE)),\"\",VLOOKUP($K14,'E12'!$B$3:$G$22,5,FALSE))","v":""},{"$f":"IF(ISNA((VLOOKUP($K14,'E12'!$B$3:$G$22,6,FALSE))),\"\",IF(ISBLANK(VLOOKUP($K14,'E12'!$B$3:$G$22,6,FALSE)),\"\",VLOOKUP($K14,'E12'!$B$3:$G$22,6,FALSE)))","v":""},{"$f":"IF(ISNA(VLOOKUP($K14,'E13'!$B$3:$G$22,5,FALSE)),\"\",VLOOKUP($K14,'E13'!$B$3:$G$22,5,FALSE))","v":""},{"$f":"IF(ISNA((VLOOKUP($K14,'E13'!$B$3:$G$22,6,FALSE))),\"\",IF(ISBLANK(VLOOKUP($K14,'E13'!$B$3:$G$22,6,FALSE)),\"\",VLOOKUP($K14,'E13'!$B$3:$G$22,6,FALSE)))","v":""},{"$f":"IF(ISNA(VLOOKUP($K14,'E14'!$B$3:$G$22,5,FALSE)),\"\",VLOOKUP($K14,'E14'!$B$3:$G$22,5,FALSE))","v":""},{"$f":"IF(ISNA((VLOOKUP($K14,'E14'!$B$3:$G$22,6,FALSE))),\"\",IF(ISBLANK(VLOOKUP($K14,'E14'!$B$3:$G$22,6,FALSE)),\"\",VLOOKUP($K14,'E14'!$B$3:$G$22,6,FALSE)))","v":""},{"$f":"IF(ISNA(VLOOKUP($K14,'E15'!$B$3:$G$22,5,FALSE)),\"\",VLOOKUP($K14,'E15'!$B$3:$G$22,5,FALSE))","v":""},{"$f":"IF(ISNA((VLOOKUP($K14,'E15'!$B$3:$G$22,6,FALSE))),\"\",IF(VLOOKUP($K14,'E15'!$B$3:$G$22,6,FALSE)=0,\"\",VLOOKUP($K14,'E15'!$B$3:$G$22,6,FALSE)))","v":""},{"$f":"IF(ISNA(VLOOKUP($K14,'E16'!$B$3:$G$22,5,FALSE)),\"\",VLOOKUP($K14,'E16'!$B$3:$G$22,5,FALSE))","v":""},{"$f":"IF(ISNA((VLOOKUP($K14,'E16'!$B$3:$G$22,6,FALSE))),\"\",IF(ISBLANK(VLOOKUP($K14,'E16'!$B$3:$G$22,6,FALSE)),\"\",VLOOKUP($K14,'E16'!$B$3:$G$22,6,FALSE)))","v":""},{"$f":"IF(ISNA(VLOOKUP($K14,'E17'!$B$3:$G$22,5,FALSE)),\"\",VLOOKUP($K14,'E17'!$B$3:$G$22,5,FALSE))","v":""},{"$f":"IF(ISNA((VLOOKUP($K14,'E17'!$B$3:$G$22,6,FALSE))),\"\",IF(ISBLANK(VLOOKUP($K14,'E17'!$B$3:$G$22,6,FALSE)),\"\",VLOOKUP($K14,'E17'!$B$3:$G$22,6,FALSE)))","v":""},{"$f":"IF(ISNA(VLOOKUP($K14,'E18'!$B$3:$G$22,5,FALSE)),\"\",VLOOKUP($K14,'E18'!$B$3:$G$22,5,FALSE))","v":""},{"$f":"IF(ISNA((VLOOKUP($K14,'E18'!$B$3:$G$22,6,FALSE))),\"\",IF(ISBLANK(VLOOKUP($K14,'E18'!$B$3:$G$22,6,FALSE)),\"\",VLOOKUP($K14,'E18'!$B$3:$G$22,6,FALSE)))","v":""},{"$f":"IF(ISNA(VLOOKUP($K14,'E19'!$B$3:$G$22,5,FALSE)),\"\",VLOOKUP($K14,'E19'!$B$3:$G$22,5,FALSE))","v":""},{"$f":"IF(ISNA((VLOOKUP($K14,'E19'!$B$3:$G$22,6,FALSE))),\"\",IF(ISBLANK(VLOOKUP($K14,'E19'!$B$3:$G$22,6,FALSE)),\"\",VLOOKUP($K14,'E19'!$B$3:$G$22,6,FALSE)))","v":""},{"$f":"IF(ISNA(VLOOKUP($K14,'E20'!$B$3:$G$22,5,FALSE)),\"\",VLOOKUP($K14,'E20'!$B$3:$G$22,5,FALSE))","v":""},{"$f":"IF(ISNA((VLOOKUP($K14,'E20'!$B$3:$G$22,6,FALSE))),\"\",IF(ISBLANK(VLOOKUP($K14,'E20'!$B$3:$G$22,6,FALSE)),\"\",VLOOKUP($K14,'E20'!$B$3:$G$22,6,FALSE)))","v":""},{"$f":"IF(ISNA(VLOOKUP($K14,'E21'!$B$3:$G$22,5,FALSE)),\"\",VLOOKUP($K14,'E21'!$B$3:$G$22,5,FALSE))","v":""},{"$f":"IF(ISNA((VLOOKUP($K14,'E21'!$B$3:$G$22,6,FALSE))),\"\",IF(ISBLANK(VLOOKUP($K14,'E21'!$B$3:$G$22,6,FALSE)),\"\",VLOOKUP($K14,'E21'!$B$3:$G$22,6,FALSE)))","v":""},{"$f":"IF(ISNA(VLOOKUP($K14,'E22'!$B$3:$G$22,5,FALSE)),\"\",VLOOKUP($K14,'E22'!$B$3:$G$22,5,FALSE))","v":""},{"$f":"IF(ISNA((VLOOKUP($K14,'E22'!$B$3:$G$22,6,FALSE))),\"\",IF(ISBLANK(VLOOKUP($K14,'E22'!$B$3:$G$22,6,FALSE)),\"\",VLOOKUP($K14,'E22'!$B$3:$G$22,6,FALSE)))","v":""},{"$f":"IF(ISNA(VLOOKUP($K14,'E23'!$B$3:$G$22,5,FALSE)),\"\",VLOOKUP($K14,'E23'!$B$3:$G$22,5,FALSE))","v":""},{"$f":"IF(ISNA((VLOOKUP($K14,'E23'!$B$3:$G$22,6,FALSE))),\"\",IF(ISBLANK(VLOOKUP($K14,'E23'!$B$3:$G$22,6,FALSE)),\"\",VLOOKUP($K14,'E23'!$B$3:$G$22,6,FALSE)))","v":""},{"$f":"IF(ISNA(VLOOKUP($K14,'E24'!$B$3:$G$22,5,FALSE)),\"\",VLOOKUP($K14,'E24'!$B$3:$G$22,5,FALSE))","v":""},{"$f":"IF(ISNA((VLOOKUP($K14,'E24'!$B$3:$G$22,6,FALSE))),\"\",IF(ISBLANK(VLOOKUP($K14,'E24'!$B$3:$G$22,6,FALSE)),\"\",VLOOKUP($K14,'E24'!$B$3:$G$22,6,FALSE)))","v":""},{"$f":"IF(ISNA(VLOOKUP($K14,'E25'!$B$3:$G$22,5,FALSE)),\"\",VLOOKUP($K14,'E25'!$B$3:$G$22,5,FALSE))","v":""},{"$f":"IF(ISNA((VLOOKUP($K14,'E25'!$B$3:$G$22,6,FALSE))),\"\",IF(ISBLANK(VLOOKUP($K14,'E25'!$B$3:$G$22,6,FALSE)),\"\",VLOOKUP($K14,'E25'!$B$3:$G$22,6,FALSE)))","v":""},{"$f":"IF(ISNA(VLOOKUP($K14,'E26'!$B$3:$G$22,5,FALSE)),\"\",VLOOKUP($K14,'E26'!$B$3:$G$22,5,FALSE))","v":""},{"$f":"IF(ISNA((VLOOKUP($K14,'E26'!$B$3:$G$22,6,FALSE))),\"\",IF(ISBLANK(VLOOKUP($K14,'E26'!$B$3:$G$22,6,FALSE)),\"\",VLOOKUP($K14,'E26'!$B$3:$G$22,6,FALSE)))","v":""},{"$f":"IF(ISNA(VLOOKUP($K14,'E27'!$B$3:$G$22,5,FALSE)),\"\",VLOOKUP($K14,'E27'!$B$3:$G$22,5,FALSE))","v":""},{"$f":"IF(ISNA((VLOOKUP($K14,'E27'!$B$3:$G$22,6,FALSE))),\"\",IF(ISBLANK(VLOOKUP($K14,'E27'!$B$3:$G$22,6,FALSE)),\"\",VLOOKUP($K14,'E27'!$B$3:$G$22,6,FALSE)))","v":""},{"$f":"IF(ISNA(VLOOKUP($K14,'E28'!$B$3:$G$22,5,FALSE)),\"\",VLOOKUP($K14,'E28'!$B$3:$G$22,5,FALSE))","v":""},{"$f":"IF(ISNA((VLOOKUP($K14,'E28'!$B$3:$G$22,6,FALSE))),\"\",IF(ISBLANK(VLOOKUP($K14,'E28'!$B$3:$G$22,6,FALSE)),\"\",VLOOKUP($K14,'E28'!$B$3:$G$22,6,FALSE)))","v":""},{"$f":"IF(ISNA(VLOOKUP($K14,'E29'!$B$3:$G$22,5,FALSE)),\"\",VLOOKUP($K14,'E29'!$B$3:$G$22,5,FALSE))","v":""},{"$f":"IF(ISNA((VLOOKUP($K14,'E29'!$B$3:$G$22,6,FALSE))),\"\",IF(ISBLANK(VLOOKUP($K14,'E29'!$B$3:$G$22,6,FALSE)),\"\",VLOOKUP($K14,'E29'!$B$3:$G$22,6,FALSE)))","v":""},{"$f":"IF(ISNA(VLOOKUP($K14,'E30'!$B$3:$G$22,5,FALSE)),\"\",VLOOKUP($K14,'E30'!$B$3:$G$22,5,FALSE))","v":""},{"$f":"IF(ISNA((VLOOKUP($K14,'E30'!$B$3:$G$22,6,FALSE))),\"\",IF(ISBLANK(VLOOKUP($K14,'E30'!$B$3:$G$22,6,FALSE)),\"\",VLOOKUP($K14,'E30'!$B$3:$G$22,6,FALSE)))","v":""}]
["E11",{"$f":"CONCATENATE('Liste classe'!E13,\" \",'Liste classe'!F13,\" \",'Liste classe'!G13,\" \",'Liste classe'!H13,\" \",'Liste classe'!I13,\" \",'Liste classe'!J13)","v":"     "},{"$f":"'E11'!$F$24","v":"00:00:00"},{"$f":"'E11'!$F$26","v":" "},{"$f":"'E11'!$G$28","v":0},{"$f":"'E11'!$I$28","v":0},{"$f":"COUNTA('E11'!$D$3:$D$22)","v":0},null,null,null,{"$f":"IF(ISBLANK(Circuits!B10),\"\",Circuits!B10)","v":""},{"$f":"IF(ISBLANK(Circuits!C10),\"\",Circuits!C10)","v":""},"","",{"$f":"IF(ISNA(VLOOKUP($K15,'E1'!$B$3:$G$22,5,FALSE)),\"\",VLOOKUP($K15,'E1'!$B$3:$G$22,5,FALSE))","v":""},{"$f":"IF(ISNA((VLOOKUP($K15,'E1'!$B$3:$G$22,6,FALSE))),\"\",IF(ISBLANK(VLOOKUP($K15,'E1'!$B$3:$G$22,6,FALSE)),\"\",VLOOKUP($K15,'E1'!$B$3:$G$22,6,FALSE)))","v":""},{"$f":"IF(ISNA(VLOOKUP($K15,'E2'!$B$3:$G$22,5,FALSE)),\"\",VLOOKUP($K15,'E2'!$B$3:$G$22,5,FALSE))","v":""},{"$f":"IF(ISNA((VLOOKUP($K15,'E2'!$B$3:$G$22,6,FALSE))),\"\",IF(ISBLANK(VLOOKUP($K15,'E2'!$B$3:$G$22,6,FALSE)),\"\",VLOOKUP($K15,'E2'!$B$3:$G$22,6,FALSE)))","v":""},{"$f":"IF(ISNA(VLOOKUP($K15,'E3'!$B$3:$G$22,5,FALSE)),\"\",VLOOKUP($K15,'E3'!$B$3:$G$22,5,FALSE))","v":""},{"$f":"IF(ISNA((VLOOKUP($K15,'E3'!$B$3:$G$22,6,FALSE))),\"\",IF(ISBLANK(VLOOKUP($K15,'E3'!$B$3:$G$22,6,FALSE)),\"\",VLOOKUP($K15,'E3'!$B$3:$G$22,6,FALSE)))","v":""},{"$f":"IF(ISNA(VLOOKUP($K15,'E4'!$B$3:$G$22,5,FALSE)),\"\",VLOOKUP($K15,'E4'!$B$3:$G$22,5,FALSE))","v":""},{"$f":"IF(ISNA((VLOOKUP($K15,'E4'!$B$3:$G$22,6,FALSE))),\"\",IF(ISBLANK(VLOOKUP($K15,'E4'!$B$3:$G$22,6,FALSE)),\"\",VLOOKUP($K15,'E4'!$B$3:$G$22,6,FALSE)))","v":""},{"$f":"IF(ISNA(VLOOKUP($K15,'E5'!$B$3:$G$22,5,FALSE)),\"\",VLOOKUP($K15,'E5'!$B$3:$G$22,5,FALSE))","v":""},{"$f":"IF(ISNA((VLOOKUP($K15,'E5'!$B$3:$G$22,6,FALSE))),\"\",IF(ISBLANK(VLOOKUP($K15,'E5'!$B$3:$G$22,6,FALSE)),\"\",VLOOKUP($K15,'E5'!$B$3:$G$22,6,FALSE)))","v":""},{"$f":"IF(ISNA(VLOOKUP($K15,'E6'!$B$3:$G$22,5,FALSE)),\"\",VLOOKUP($K15,'E6'!$B$3:$G$22,5,FALSE))","v":""},{"$f":"IF(ISNA((VLOOKUP($K15,'E6'!$B$3:$G$22,6,FALSE))),\"\",IF(ISBLANK(VLOOKUP($K15,'E6'!$B$3:$G$22,6,FALSE)),\"\",VLOOKUP($K15,'E6'!$B$3:$G$22,6,FALSE)))","v":""},{"$f":"IF(ISNA(VLOOKUP($K15,'E7'!$B$3:$G$22,5,FALSE)),\"\",VLOOKUP($K15,'E7'!$B$3:$G$22,5,FALSE))","v":""},{"$f":"IF(ISNA((VLOOKUP($K15,'E7'!$B$3:$G$22,6,FALSE))),\"\",IF(ISBLANK(VLOOKUP($K15,'E7'!$B$3:$G$22,6,FALSE)),\"\",VLOOKUP($K15,'E7'!$B$3:$G$22,6,FALSE)))","v":""},{"$f":"IF(ISNA(VLOOKUP($K15,'E8'!$B$3:$G$22,5,FALSE)),\"\",VLOOKUP($K15,'E8'!$B$3:$G$22,5,FALSE))","v":""},{"$f":"IF(ISNA((VLOOKUP($K15,'E8'!$B$3:$G$22,6,FALSE))),\"\",IF(ISBLANK(VLOOKUP($K15,'E8'!$B$3:$G$22,6,FALSE)),\"\",VLOOKUP($K15,'E8'!$B$3:$G$22,6,FALSE)))","v":""},{"$f":"IF(ISNA(VLOOKUP($K15,'E9'!$B$3:$G$22,5,FALSE)),\"\",VLOOKUP($K15,'E9'!$B$3:$G$22,5,FALSE))","v":""},{"$f":"IF(ISNA((VLOOKUP($K15,'E9'!$B$3:$G$22,6,FALSE))),\"\",IF(ISBLANK(VLOOKUP($K15,'E9'!$B$3:$G$22,6,FALSE)),\"\",VLOOKUP($K15,'E9'!$B$3:$G$22,6,FALSE)))","v":""},{"$f":"IF(ISNA(VLOOKUP($K15,'E10'!$B$3:$G$22,5,FALSE)),\"\",VLOOKUP($K15,'E10'!$B$3:$G$22,5,FALSE))","v":""},{"$f":"IF(ISNA((VLOOKUP($K15,'E10'!$B$3:$G$22,6,FALSE))),\"\",IF(ISBLANK(VLOOKUP($K15,'E10'!$B$3:$G$22,6,FALSE)),\"\",VLOOKUP($K15,'E10'!$B$3:$G$22,6,FALSE)))","v":""},{"$f":"IF(ISNA(VLOOKUP($K15,'E11'!$B$3:$G$22,5,FALSE)),\"\",VLOOKUP($K15,'E11'!$B$3:$G$22,5,FALSE))","v":""},{"$f":"IF(ISNA((VLOOKUP($K15,'E11'!$B$3:$G$22,6,FALSE))),\"\",IF(ISBLANK(VLOOKUP($K15,'E11'!$B$3:$G$22,6,FALSE)),\"\",VLOOKUP($K15,'E11'!$B$3:$G$22,6,FALSE)))","v":""},{"$f":"IF(ISNA(VLOOKUP($K15,'E12'!$B$3:$G$22,5,FALSE)),\"\",VLOOKUP($K15,'E12'!$B$3:$G$22,5,FALSE))","v":""},{"$f":"IF(ISNA((VLOOKUP($K15,'E12'!$B$3:$G$22,6,FALSE))),\"\",IF(ISBLANK(VLOOKUP($K15,'E12'!$B$3:$G$22,6,FALSE)),\"\",VLOOKUP($K15,'E12'!$B$3:$G$22,6,FALSE)))","v":""},{"$f":"IF(ISNA(VLOOKUP($K15,'E13'!$B$3:$G$22,5,FALSE)),\"\",VLOOKUP($K15,'E13'!$B$3:$G$22,5,FALSE))","v":""},{"$f":"IF(ISNA((VLOOKUP($K15,'E13'!$B$3:$G$22,6,FALSE))),\"\",IF(ISBLANK(VLOOKUP($K15,'E13'!$B$3:$G$22,6,FALSE)),\"\",VLOOKUP($K15,'E13'!$B$3:$G$22,6,FALSE)))","v":""},{"$f":"IF(ISNA(VLOOKUP($K15,'E14'!$B$3:$G$22,5,FALSE)),\"\",VLOOKUP($K15,'E14'!$B$3:$G$22,5,FALSE))","v":""},{"$f":"IF(ISNA((VLOOKUP($K15,'E14'!$B$3:$G$22,6,FALSE))),\"\",IF(ISBLANK(VLOOKUP($K15,'E14'!$B$3:$G$22,6,FALSE)),\"\",VLOOKUP($K15,'E14'!$B$3:$G$22,6,FALSE)))","v":""},{"$f":"IF(ISNA(VLOOKUP($K15,'E15'!$B$3:$G$22,5,FALSE)),\"\",VLOOKUP($K15,'E15'!$B$3:$G$22,5,FALSE))","v":""},{"$f":"IF(ISNA((VLOOKUP($K15,'E15'!$B$3:$G$22,6,FALSE))),\"\",IF(VLOOKUP($K15,'E15'!$B$3:$G$22,6,FALSE)=0,\"\",VLOOKUP($K15,'E15'!$B$3:$G$22,6,FALSE)))","v":""},{"$f":"IF(ISNA(VLOOKUP($K15,'E16'!$B$3:$G$22,5,FALSE)),\"\",VLOOKUP($K15,'E16'!$B$3:$G$22,5,FALSE))","v":""},{"$f":"IF(ISNA((VLOOKUP($K15,'E16'!$B$3:$G$22,6,FALSE))),\"\",IF(ISBLANK(VLOOKUP($K15,'E16'!$B$3:$G$22,6,FALSE)),\"\",VLOOKUP($K15,'E16'!$B$3:$G$22,6,FALSE)))","v":""},{"$f":"IF(ISNA(VLOOKUP($K15,'E17'!$B$3:$G$22,5,FALSE)),\"\",VLOOKUP($K15,'E17'!$B$3:$G$22,5,FALSE))","v":""},{"$f":"IF(ISNA((VLOOKUP($K15,'E17'!$B$3:$G$22,6,FALSE))),\"\",IF(ISBLANK(VLOOKUP($K15,'E17'!$B$3:$G$22,6,FALSE)),\"\",VLOOKUP($K15,'E17'!$B$3:$G$22,6,FALSE)))","v":""},{"$f":"IF(ISNA(VLOOKUP($K15,'E18'!$B$3:$G$22,5,FALSE)),\"\",VLOOKUP($K15,'E18'!$B$3:$G$22,5,FALSE))","v":""},{"$f":"IF(ISNA((VLOOKUP($K15,'E18'!$B$3:$G$22,6,FALSE))),\"\",IF(ISBLANK(VLOOKUP($K15,'E18'!$B$3:$G$22,6,FALSE)),\"\",VLOOKUP($K15,'E18'!$B$3:$G$22,6,FALSE)))","v":""},{"$f":"IF(ISNA(VLOOKUP($K15,'E19'!$B$3:$G$22,5,FALSE)),\"\",VLOOKUP($K15,'E19'!$B$3:$G$22,5,FALSE))","v":""},{"$f":"IF(ISNA((VLOOKUP($K15,'E19'!$B$3:$G$22,6,FALSE))),\"\",IF(ISBLANK(VLOOKUP($K15,'E19'!$B$3:$G$22,6,FALSE)),\"\",VLOOKUP($K15,'E19'!$B$3:$G$22,6,FALSE)))","v":""},{"$f":"IF(ISNA(VLOOKUP($K15,'E20'!$B$3:$G$22,5,FALSE)),\"\",VLOOKUP($K15,'E20'!$B$3:$G$22,5,FALSE))","v":""},{"$f":"IF(ISNA((VLOOKUP($K15,'E20'!$B$3:$G$22,6,FALSE))),\"\",IF(ISBLANK(VLOOKUP($K15,'E20'!$B$3:$G$22,6,FALSE)),\"\",VLOOKUP($K15,'E20'!$B$3:$G$22,6,FALSE)))","v":""},{"$f":"IF(ISNA(VLOOKUP($K15,'E21'!$B$3:$G$22,5,FALSE)),\"\",VLOOKUP($K15,'E21'!$B$3:$G$22,5,FALSE))","v":""},{"$f":"IF(ISNA((VLOOKUP($K15,'E21'!$B$3:$G$22,6,FALSE))),\"\",IF(ISBLANK(VLOOKUP($K15,'E21'!$B$3:$G$22,6,FALSE)),\"\",VLOOKUP($K15,'E21'!$B$3:$G$22,6,FALSE)))","v":""},{"$f":"IF(ISNA(VLOOKUP($K15,'E22'!$B$3:$G$22,5,FALSE)),\"\",VLOOKUP($K15,'E22'!$B$3:$G$22,5,FALSE))","v":""},{"$f":"IF(ISNA((VLOOKUP($K15,'E22'!$B$3:$G$22,6,FALSE))),\"\",IF(ISBLANK(VLOOKUP($K15,'E22'!$B$3:$G$22,6,FALSE)),\"\",VLOOKUP($K15,'E22'!$B$3:$G$22,6,FALSE)))","v":""},{"$f":"IF(ISNA(VLOOKUP($K15,'E23'!$B$3:$G$22,5,FALSE)),\"\",VLOOKUP($K15,'E23'!$B$3:$G$22,5,FALSE))","v":""},{"$f":"IF(ISNA((VLOOKUP($K15,'E23'!$B$3:$G$22,6,FALSE))),\"\",IF(ISBLANK(VLOOKUP($K15,'E23'!$B$3:$G$22,6,FALSE)),\"\",VLOOKUP($K15,'E23'!$B$3:$G$22,6,FALSE)))","v":""},{"$f":"IF(ISNA(VLOOKUP($K15,'E24'!$B$3:$G$22,5,FALSE)),\"\",VLOOKUP($K15,'E24'!$B$3:$G$22,5,FALSE))","v":""},{"$f":"IF(ISNA((VLOOKUP($K15,'E24'!$B$3:$G$22,6,FALSE))),\"\",IF(ISBLANK(VLOOKUP($K15,'E24'!$B$3:$G$22,6,FALSE)),\"\",VLOOKUP($K15,'E24'!$B$3:$G$22,6,FALSE)))","v":""},{"$f":"IF(ISNA(VLOOKUP($K15,'E25'!$B$3:$G$22,5,FALSE)),\"\",VLOOKUP($K15,'E25'!$B$3:$G$22,5,FALSE))","v":""},{"$f":"IF(ISNA((VLOOKUP($K15,'E25'!$B$3:$G$22,6,FALSE))),\"\",IF(ISBLANK(VLOOKUP($K15,'E25'!$B$3:$G$22,6,FALSE)),\"\",VLOOKUP($K15,'E25'!$B$3:$G$22,6,FALSE)))","v":""},{"$f":"IF(ISNA(VLOOKUP($K15,'E26'!$B$3:$G$22,5,FALSE)),\"\",VLOOKUP($K15,'E26'!$B$3:$G$22,5,FALSE))","v":""},{"$f":"IF(ISNA((VLOOKUP($K15,'E26'!$B$3:$G$22,6,FALSE))),\"\",IF(ISBLANK(VLOOKUP($K15,'E26'!$B$3:$G$22,6,FALSE)),\"\",VLOOKUP($K15,'E26'!$B$3:$G$22,6,FALSE)))","v":""},{"$f":"IF(ISNA(VLOOKUP($K15,'E27'!$B$3:$G$22,5,FALSE)),\"\",VLOOKUP($K15,'E27'!$B$3:$G$22,5,FALSE))","v":""},{"$f":"IF(ISNA((VLOOKUP($K15,'E27'!$B$3:$G$22,6,FALSE))),\"\",IF(ISBLANK(VLOOKUP($K15,'E27'!$B$3:$G$22,6,FALSE)),\"\",VLOOKUP($K15,'E27'!$B$3:$G$22,6,FALSE)))","v":""},{"$f":"IF(ISNA(VLOOKUP($K15,'E28'!$B$3:$G$22,5,FALSE)),\"\",VLOOKUP($K15,'E28'!$B$3:$G$22,5,FALSE))","v":""},{"$f":"IF(ISNA((VLOOKUP($K15,'E28'!$B$3:$G$22,6,FALSE))),\"\",IF(ISBLANK(VLOOKUP($K15,'E28'!$B$3:$G$22,6,FALSE)),\"\",VLOOKUP($K15,'E28'!$B$3:$G$22,6,FALSE)))","v":""},{"$f":"IF(ISNA(VLOOKUP($K15,'E29'!$B$3:$G$22,5,FALSE)),\"\",VLOOKUP($K15,'E29'!$B$3:$G$22,5,FALSE))","v":""},{"$f":"IF(ISNA((VLOOKUP($K15,'E29'!$B$3:$G$22,6,FALSE))),\"\",IF(ISBLANK(VLOOKUP($K15,'E29'!$B$3:$G$22,6,FALSE)),\"\",VLOOKUP($K15,'E29'!$B$3:$G$22,6,FALSE)))","v":""},{"$f":"IF(ISNA(VLOOKUP($K15,'E30'!$B$3:$G$22,5,FALSE)),\"\",VLOOKUP($K15,'E30'!$B$3:$G$22,5,FALSE))","v":""},{"$f":"IF(ISNA((VLOOKUP($K15,'E30'!$B$3:$G$22,6,FALSE))),\"\",IF(ISBLANK(VLOOKUP($K15,'E30'!$B$3:$G$22,6,FALSE)),\"\",VLOOKUP($K15,'E30'!$B$3:$G$22,6,FALSE)))","v":""}]
["E12",{"$f":"CONCATENATE('Liste classe'!E14,\" \",'Liste classe'!F14,\" \",'Liste classe'!G14,\" \",'Liste classe'!H14,\" \",'Liste classe'!I14,\" \",'Liste classe'!J14)","v":"     "},{"$f":"'E12'!$F$24","v":"00:00:00"},{"$f":"'E12'!$F$26","v":" "},{"$f":"'E12'!$G$28","v":0},{"$f":"'E12'!$I$28","v":0},{"$f":"COUNTA('E12'!$D$3:$D$22)","v":0},null,null,null,{"$f":"IF(ISBLANK(Circuits!B11),\"\",Circuits!B11)","v":""},{"$f":"IF(ISBLANK(Circuits!C11),\"\",Circuits!C11)","v":""},"","",{"$f":"IF(ISNA(VLOOKUP($K16,'E1'!$B$3:$G$22,5,FALSE)),\"\",VLOOKUP($K16,'E1'!$B$3:$G$22,5,FALSE))","v":""},{"$f":"IF(ISNA((VLOOKUP($K16,'E1'!$B$3:$G$22,6,FALSE))),\"\",IF(ISBLANK(VLOOKUP($K16,'E1'!$B$3:$G$22,6,FALSE)),\"\",VLOOKUP($K16,'E1'!$B$3:$G$22,6,FALSE)))","v":""},{"$f":"IF(ISNA(VLOOKUP($K16,'E2'!$B$3:$G$22,5,FALSE)),\"\",VLOOKUP($K16,'E2'!$B$3:$G$22,5,FALSE))","v":""},{"$f":"IF(ISNA((VLOOKUP($K16,'E2'!$B$3:$G$22,6,FALSE))),\"\",IF(ISBLANK(VLOOKUP($K16,'E2'!$B$3:$G$22,6,FALSE)),\"\",VLOOKUP($K16,'E2'!$B$3:$G$22,6,FALSE)))","v":""},{"$f":"IF(ISNA(VLOOKUP($K16,'E3'!$B$3:$G$22,5,FALSE)),\"\",VLOOKUP($K16,'E3'!$B$3:$G$22,5,FALSE))","v":""},{"$f":"IF(ISNA((VLOOKUP($K16,'E3'!$B$3:$G$22,6,FALSE))),\"\",IF(ISBLANK(VLOOKUP($K16,'E3'!$B$3:$G$22,6,FALSE)),\"\",VLOOKUP($K16,'E3'!$B$3:$G$22,6,FALSE)))","v":""},{"$f":"IF(ISNA(VLOOKUP($K16,'E4'!$B$3:$G$22,5,FALSE)),\"\",VLOOKUP($K16,'E4'!$B$3:$G$22,5,FALSE))","v":""},{"$f":"IF(ISNA((VLOOKUP($K16,'E4'!$B$3:$G$22,6,FALSE))),\"\",IF(ISBLANK(VLOOKUP($K16,'E4'!$B$3:$G$22,6,FALSE)),\"\",VLOOKUP($K16,'E4'!$B$3:$G$22,6,FALSE)))","v":""},{"$f":"IF(ISNA(VLOOKUP($K16,'E5'!$B$3:$G$22,5,FALSE)),\"\",VLOOKUP($K16,'E5'!$B$3:$G$22,5,FALSE))","v":""},{"$f":"IF(ISNA((VLOOKUP($K16,'E5'!$B$3:$G$22,6,FALSE))),\"\",IF(ISBLANK(VLOOKUP($K16,'E5'!$B$3:$G$22,6,FALSE)),\"\",VLOOKUP($K16,'E5'!$B$3:$G$22,6,FALSE)))","v":""},{"$f":"IF(ISNA(VLOOKUP($K16,'E6'!$B$3:$G$22,5,FALSE)),\"\",VLOOKUP($K16,'E6'!$B$3:$G$22,5,FALSE))","v":""},{"$f":"IF(ISNA((VLOOKUP($K16,'E6'!$B$3:$G$22,6,FALSE))),\"\",IF(ISBLANK(VLOOKUP($K16,'E6'!$B$3:$G$22,6,FALSE)),\"\",VLOOKUP($K16,'E6'!$B$3:$G$22,6,FALSE)))","v":""},{"$f":"IF(ISNA(VLOOKUP($K16,'E7'!$B$3:$G$22,5,FALSE)),\"\",VLOOKUP($K16,'E7'!$B$3:$G$22,5,FALSE))","v":""},{"$f":"IF(ISNA((VLOOKUP($K16,'E7'!$B$3:$G$22,6,FALSE))),\"\",IF(ISBLANK(VLOOKUP($K16,'E7'!$B$3:$G$22,6,FALSE)),\"\",VLOOKUP($K16,'E7'!$B$3:$G$22,6,FALSE)))","v":""},{"$f":"IF(ISNA(VLOOKUP($K16,'E8'!$B$3:$G$22,5,FALSE)),\"\",VLOOKUP($K16,'E8'!$B$3:$G$22,5,FALSE))","v":""},{"$f":"IF(ISNA((VLOOKUP($K16,'E8'!$B$3:$G$22,6,FALSE))),\"\",IF(ISBLANK(VLOOKUP($K16,'E8'!$B$3:$G$22,6,FALSE)),\"\",VLOOKUP($K16,'E8'!$B$3:$G$22,6,FALSE)))","v":""},{"$f":"IF(ISNA(VLOOKUP($K16,'E9'!$B$3:$G$22,5,FALSE)),\"\",VLOOKUP($K16,'E9'!$B$3:$G$22,5,FALSE))","v":""},{"$f":"IF(ISNA((VLOOKUP($K16,'E9'!$B$3:$G$22,6,FALSE))),\"\",IF(ISBLANK(VLOOKUP($K16,'E9'!$B$3:$G$22,6,FALSE)),\"\",VLOOKUP($K16,'E9'!$B$3:$G$22,6,FALSE)))","v":""},{"$f":"IF(ISNA(VLOOKUP($K16,'E10'!$B$3:$G$22,5,FALSE)),\"\",VLOOKUP($K16,'E10'!$B$3:$G$22,5,FALSE))","v":""},{"$f":"IF(ISNA((VLOOKUP($K16,'E10'!$B$3:$G$22,6,FALSE))),\"\",IF(ISBLANK(VLOOKUP($K16,'E10'!$B$3:$G$22,6,FALSE)),\"\",VLOOKUP($K16,'E10'!$B$3:$G$22,6,FALSE)))","v":""},{"$f":"IF(ISNA(VLOOKUP($K16,'E11'!$B$3:$G$22,5,FALSE)),\"\",VLOOKUP($K16,'E11'!$B$3:$G$22,5,FALSE))","v":""},{"$f":"IF(ISNA((VLOOKUP($K16,'E11'!$B$3:$G$22,6,FALSE))),\"\",IF(ISBLANK(VLOOKUP($K16,'E11'!$B$3:$G$22,6,FALSE)),\"\",VLOOKUP($K16,'E11'!$B$3:$G$22,6,FALSE)))","v":""},{"$f":"IF(ISNA(VLOOKUP($K16,'E12'!$B$3:$G$22,5,FALSE)),\"\",VLOOKUP($K16,'E12'!$B$3:$G$22,5,FALSE))","v":""},{"$f":"IF(ISNA((VLOOKUP($K16,'E12'!$B$3:$G$22,6,FALSE))),\"\",IF(ISBLANK(VLOOKUP($K16,'E12'!$B$3:$G$22,6,FALSE)),\"\",VLOOKUP($K16,'E12'!$B$3:$G$22,6,FALSE)))","v":""},{"$f":"IF(ISNA(VLOOKUP($K16,'E13'!$B$3:$G$22,5,FALSE)),\"\",VLOOKUP($K16,'E13'!$B$3:$G$22,5,FALSE))","v":""},{"$f":"IF(ISNA((VLOOKUP($K16,'E13'!$B$3:$G$22,6,FALSE))),\"\",IF(ISBLANK(VLOOKUP($K16,'E13'!$B$3:$G$22,6,FALSE)),\"\",VLOOKUP($K16,'E13'!$B$3:$G$22,6,FALSE)))","v":""},{"$f":"IF(ISNA(VLOOKUP($K16,'E14'!$B$3:$G$22,5,FALSE)),\"\",VLOOKUP($K16,'E14'!$B$3:$G$22,5,FALSE))","v":""},{"$f":"IF(ISNA((VLOOKUP($K16,'E14'!$B$3:$G$22,6,FALSE))),\"\",IF(ISBLANK(VLOOKUP($K16,'E14'!$B$3:$G$22,6,FALSE)),\"\",VLOOKUP($K16,'E14'!$B$3:$G$22,6,FALSE)))","v":""},{"$f":"IF(ISNA(VLOOKUP($K16,'E15'!$B$3:$G$22,5,FALSE)),\"\",VLOOKUP($K16,'E15'!$B$3:$G$22,5,FALSE))","v":""},{"$f":"IF(ISNA((VLOOKUP($K16,'E15'!$B$3:$G$22,6,FALSE))),\"\",IF(VLOOKUP($K16,'E15'!$B$3:$G$22,6,FALSE)=0,\"\",VLOOKUP($K16,'E15'!$B$3:$G$22,6,FALSE)))","v":""},{"$f":"IF(ISNA(VLOOKUP($K16,'E16'!$B$3:$G$22,5,FALSE)),\"\",VLOOKUP($K16,'E16'!$B$3:$G$22,5,FALSE))","v":""},{"$f":"IF(ISNA((VLOOKUP($K16,'E16'!$B$3:$G$22,6,FALSE))),\"\",IF(ISBLANK(VLOOKUP($K16,'E16'!$B$3:$G$22,6,FALSE)),\"\",VLOOKUP($K16,'E16'!$B$3:$G$22,6,FALSE)))","v":""},{"$f":"IF(ISNA(VLOOKUP($K16,'E17'!$B$3:$G$22,5,FALSE)),\"\",VLOOKUP($K16,'E17'!$B$3:$G$22,5,FALSE))","v":""},{"$f":"IF(ISNA((VLOOKUP($K16,'E17'!$B$3:$G$22,6,FALSE))),\"\",IF(ISBLANK(VLOOKUP($K16,'E17'!$B$3:$G$22,6,FALSE)),\"\",VLOOKUP($K16,'E17'!$B$3:$G$22,6,FALSE)))","v":""},{"$f":"IF(ISNA(VLOOKUP($K16,'E18'!$B$3:$G$22,5,FALSE)),\"\",VLOOKUP($K16,'E18'!$B$3:$G$22,5,FALSE))","v":""},{"$f":"IF(ISNA((VLOOKUP($K16,'E18'!$B$3:$G$22,6,FALSE))),\"\",IF(ISBLANK(VLOOKUP($K16,'E18'!$B$3:$G$22,6,FALSE)),\"\",VLOOKUP($K16,'E18'!$B$3:$G$22,6,FALSE)))","v":""},{"$f":"IF(ISNA(VLOOKUP($K16,'E19'!$B$3:$G$22,5,FALSE)),\"\",VLOOKUP($K16,'E19'!$B$3:$G$22,5,FALSE))","v":""},{"$f":"IF(ISNA((VLOOKUP($K16,'E19'!$B$3:$G$22,6,FALSE))),\"\",IF(ISBLANK(VLOOKUP($K16,'E19'!$B$3:$G$22,6,FALSE)),\"\",VLOOKUP($K16,'E19'!$B$3:$G$22,6,FALSE)))","v":""},{"$f":"IF(ISNA(VLOOKUP($K16,'E20'!$B$3:$G$22,5,FALSE)),\"\",VLOOKUP($K16,'E20'!$B$3:$G$22,5,FALSE))","v":""},{"$f":"IF(ISNA((VLOOKUP($K16,'E20'!$B$3:$G$22,6,FALSE))),\"\",IF(ISBLANK(VLOOKUP($K16,'E20'!$B$3:$G$22,6,FALSE)),\"\",VLOOKUP($K16,'E20'!$B$3:$G$22,6,FALSE)))","v":""},{"$f":"IF(ISNA(VLOOKUP($K16,'E21'!$B$3:$G$22,5,FALSE)),\"\",VLOOKUP($K16,'E21'!$B$3:$G$22,5,FALSE))","v":""},{"$f":"IF(ISNA((VLOOKUP($K16,'E21'!$B$3:$G$22,6,FALSE))),\"\",IF(ISBLANK(VLOOKUP($K16,'E21'!$B$3:$G$22,6,FALSE)),\"\",VLOOKUP($K16,'E21'!$B$3:$G$22,6,FALSE)))","v":""},{"$f":"IF(ISNA(VLOOKUP($K16,'E22'!$B$3:$G$22,5,FALSE)),\"\",VLOOKUP($K16,'E22'!$B$3:$G$22,5,FALSE))","v":""},{"$f":"IF(ISNA((VLOOKUP($K16,'E22'!$B$3:$G$22,6,FALSE))),\"\",IF(ISBLANK(VLOOKUP($K16,'E22'!$B$3:$G$22,6,FALSE)),\"\",VLOOKUP($K16,'E22'!$B$3:$G$22,6,FALSE)))","v":""},{"$f":"IF(ISNA(VLOOKUP($K16,'E23'!$B$3:$G$22,5,FALSE)),\"\",VLOOKUP($K16,'E23'!$B$3:$G$22,5,FALSE))","v":""},{"$f":"IF(ISNA((VLOOKUP($K16,'E23'!$B$3:$G$22,6,FALSE))),\"\",IF(ISBLANK(VLOOKUP($K16,'E23'!$B$3:$G$22,6,FALSE)),\"\",VLOOKUP($K16,'E23'!$B$3:$G$22,6,FALSE)))","v":""},{"$f":"IF(ISNA(VLOOKUP($K16,'E24'!$B$3:$G$22,5,FALSE)),\"\",VLOOKUP($K16,'E24'!$B$3:$G$22,5,FALSE))","v":""},{"$f":"IF(ISNA((VLOOKUP($K16,'E24'!$B$3:$G$22,6,FALSE))),\"\",IF(ISBLANK(VLOOKUP($K16,'E24'!$B$3:$G$22,6,FALSE)),\"\",VLOOKUP($K16,'E24'!$B$3:$G$22,6,FALSE)))","v":""},{"$f":"IF(ISNA(VLOOKUP($K16,'E25'!$B$3:$G$22,5,FALSE)),\"\",VLOOKUP($K16,'E25'!$B$3:$G$22,5,FALSE))","v":""},{"$f":"IF(ISNA((VLOOKUP($K16,'E25'!$B$3:$G$22,6,FALSE))),\"\",IF(ISBLANK(VLOOKUP($K16,'E25'!$B$3:$G$22,6,FALSE)),\"\",VLOOKUP($K16,'E25'!$B$3:$G$22,6,FALSE)))","v":""},{"$f":"IF(ISNA(VLOOKUP($K16,'E26'!$B$3:$G$22,5,FALSE)),\"\",VLOOKUP($K16,'E26'!$B$3:$G$22,5,FALSE))","v":""},{"$f":"IF(ISNA((VLOOKUP($K16,'E26'!$B$3:$G$22,6,FALSE))),\"\",IF(ISBLANK(VLOOKUP($K16,'E26'!$B$3:$G$22,6,FALSE)),\"\",VLOOKUP($K16,'E26'!$B$3:$G$22,6,FALSE)))","v":""},{"$f":"IF(ISNA(VLOOKUP($K16,'E27'!$B$3:$G$22,5,FALSE)),\"\",VLOOKUP($K16,'E27'!$B$3:$G$22,5,FALSE))","v":""},{"$f":"IF(ISNA((VLOOKUP($K16,'E27'!$B$3:$G$22,6,FALSE))),\"\",IF(ISBLANK(VLOOKUP($K16,'E27'!$B$3:$G$22,6,FALSE)),\"\",VLOOKUP($K16,'E27'!$B$3:$G$22,6,FALSE)))","v":""},{"$f":"IF(ISNA(VLOOKUP($K16,'E28'!$B$3:$G$22,5,FALSE)),\"\",VLOOKUP($K16,'E28'!$B$3:$G$22,5,FALSE))","v":""},{"$f":"IF(ISNA((VLOOKUP($K16,'E28'!$B$3:$G$22,6,FALSE))),\"\",IF(ISBLANK(VLOOKUP($K16,'E28'!$B$3:$G$22,6,FALSE)),\"\",VLOOKUP($K16,'E28'!$B$3:$G$22,6,FALSE)))","v":""},{"$f":"IF(ISNA(VLOOKUP($K16,'E29'!$B$3:$G$22,5,FALSE)),\"\",VLOOKUP($K16,'E29'!$B$3:$G$22,5,FALSE))","v":""},{"$f":"IF(ISNA((VLOOKUP($K16,'E29'!$B$3:$G$22,6,FALSE))),\"\",IF(ISBLANK(VLOOKUP($K16,'E29'!$B$3:$G$22,6,FALSE)),\"\",VLOOKUP($K16,'E29'!$B$3:$G$22,6,FALSE)))","v":""},{"$f":"IF(ISNA(VLOOKUP($K16,'E30'!$B$3:$G$22,5,FALSE)),\"\",VLOOKUP($K16,'E30'!$B$3:$G$22,5,FALSE))","v":""},{"$f":"IF(ISNA((VLOOKUP($K16,'E30'!$B$3:$G$22,6,FALSE))),\"\",IF(ISBLANK(VLOOKUP($K16,'E30'!$B$3:$G$22,6,FALSE)),\"\",VLOOKUP($K16,'E30'!$B$3:$G$22,6,FALSE)))","v":""}]
["E13",{"$f":"CONCATENATE('Liste classe'!E15,\" \",'Liste classe'!F15,\" \",'Liste classe'!G15,\" \",'Liste classe'!H15,\" \",'Liste classe'!I15,\" \",'Liste classe'!J15)","v":"     "},{"$f":"'E13'!$F$24","v":"00:00:00"},{"$f":"'E13'!$F$26","v":" "},{"$f":"'E13'!$G$28","v":0},{"$f":"'E13'!$I$28","v":0},{"$f":"COUNTA('E13'!$D$3:$D$22)","v":0},null,null,null,{"$f":"IF(ISBLANK(Circuits!B12),\"\",Circuits!B12)","v":""},{"$f":"IF(ISBLANK(Circuits!C12),\"\",Circuits!C12)","v":""},"","",{"$f":"IF(ISNA(VLOOKUP($K17,'E1'!$B$3:$G$22,5,FALSE)),\"\",VLOOKUP($K17,'E1'!$B$3:$G$22,5,FALSE))","v":""},{"$f":"IF(ISNA((VLOOKUP($K17,'E1'!$B$3:$G$22,6,FALSE))),\"\",IF(ISBLANK(VLOOKUP($K17,'E1'!$B$3:$G$22,6,FALSE)),\"\",VLOOKUP($K17,'E1'!$B$3:$G$22,6,FALSE)))","v":""},{"$f":"IF(ISNA(VLOOKUP($K17,'E2'!$B$3:$G$22,5,FALSE)),\"\",VLOOKUP($K17,'E2'!$B$3:$G$22,5,FALSE))","v":""},{"$f":"IF(ISNA((VLOOKUP($K17,'E2'!$B$3:$G$22,6,FALSE))),\"\",IF(ISBLANK(VLOOKUP($K17,'E2'!$B$3:$G$22,6,FALSE)),\"\",VLOOKUP($K17,'E2'!$B$3:$G$22,6,FALSE)))","v":""},{"$f":"IF(ISNA(VLOOKUP($K17,'E3'!$B$3:$G$22,5,FALSE)),\"\",VLOOKUP($K17,'E3'!$B$3:$G$22,5,FALSE))","v":""},{"$f":"IF(ISNA((VLOOKUP($K17,'E3'!$B$3:$G$22,6,FALSE))),\"\",IF(ISBLANK(VLOOKUP($K17,'E3'!$B$3:$G$22,6,FALSE)),\"\",VLOOKUP($K17,'E3'!$B$3:$G$22,6,FALSE)))","v":""},{"$f":"IF(ISNA(VLOOKUP($K17,'E4'!$B$3:$G$22,5,FALSE)),\"\",VLOOKUP($K17,'E4'!$B$3:$G$22,5,FALSE))","v":""},{"$f":"IF(ISNA((VLOOKUP($K17,'E4'!$B$3:$G$22,6,FALSE))),\"\",IF(ISBLANK(VLOOKUP($K17,'E4'!$B$3:$G$22,6,FALSE)),\"\",VLOOKUP($K17,'E4'!$B$3:$G$22,6,FALSE)))","v":""},{"$f":"IF(ISNA(VLOOKUP($K17,'E5'!$B$3:$G$22,5,FALSE)),\"\",VLOOKUP($K17,'E5'!$B$3:$G$22,5,FALSE))","v":""},{"$f":"IF(ISNA((VLOOKUP($K17,'E5'!$B$3:$G$22,6,FALSE))),\"\",IF(ISBLANK(VLOOKUP($K17,'E5'!$B$3:$G$22,6,FALSE)),\"\",VLOOKUP($K17,'E5'!$B$3:$G$22,6,FALSE)))","v":""},{"$f":"IF(ISNA(VLOOKUP($K17,'E6'!$B$3:$G$22,5,FALSE)),\"\",VLOOKUP($K17,'E6'!$B$3:$G$22,5,FALSE))","v":""},{"$f":"IF(ISNA((VLOOKUP($K17,'E6'!$B$3:$G$22,6,FALSE))),\"\",IF(ISBLANK(VLOOKUP($K17,'E6'!$B$3:$G$22,6,FALSE)),\"\",VLOOKUP($K17,'E6'!$B$3:$G$22,6,FALSE)))","v":""},{"$f":"IF(ISNA(VLOOKUP($K17,'E7'!$B$3:$G$22,5,FALSE)),\"\",VLOOKUP($K17,'E7'!$B$3:$G$22,5,FALSE))","v":""},{"$f":"IF(ISNA((VLOOKUP($K17,'E7'!$B$3:$G$22,6,FALSE))),\"\",IF(ISBLANK(VLOOKUP($K17,'E7'!$B$3:$G$22,6,FALSE)),\"\",VLOOKUP($K17,'E7'!$B$3:$G$22,6,FALSE)))","v":""},{"$f":"IF(ISNA(VLOOKUP($K17,'E8'!$B$3:$G$22,5,FALSE)),\"\",VLOOKUP($K17,'E8'!$B$3:$G$22,5,FALSE))","v":""},{"$f":"IF(ISNA((VLOOKUP($K17,'E8'!$B$3:$G$22,6,FALSE))),\"\",IF(ISBLANK(VLOOKUP($K17,'E8'!$B$3:$G$22,6,FALSE)),\"\",VLOOKUP($K17,'E8'!$B$3:$G$22,6,FALSE)))","v":""},{"$f":"IF(ISNA(VLOOKUP($K17,'E9'!$B$3:$G$22,5,FALSE)),\"\",VLOOKUP($K17,'E9'!$B$3:$G$22,5,FALSE))","v":""},{"$f":"IF(ISNA((VLOOKUP($K17,'E9'!$B$3:$G$22,6,FALSE))),\"\",IF(ISBLANK(VLOOKUP($K17,'E9'!$B$3:$G$22,6,FALSE)),\"\",VLOOKUP($K17,'E9'!$B$3:$G$22,6,FALSE)))","v":""},{"$f":"IF(ISNA(VLOOKUP($K17,'E10'!$B$3:$G$22,5,FALSE)),\"\",VLOOKUP($K17,'E10'!$B$3:$G$22,5,FALSE))","v":""},{"$f":"IF(ISNA((VLOOKUP($K17,'E10'!$B$3:$G$22,6,FALSE))),\"\",IF(ISBLANK(VLOOKUP($K17,'E10'!$B$3:$G$22,6,FALSE)),\"\",VLOOKUP($K17,'E10'!$B$3:$G$22,6,FALSE)))","v":""},{"$f":"IF(ISNA(VLOOKUP($K17,'E11'!$B$3:$G$22,5,FALSE)),\"\",VLOOKUP($K17,'E11'!$B$3:$G$22,5,FALSE))","v":""},{"$f":"IF(ISNA((VLOOKUP($K17,'E11'!$B$3:$G$22,6,FALSE))),\"\",IF(ISBLANK(VLOOKUP($K17,'E11'!$B$3:$G$22,6,FALSE)),\"\",VLOOKUP($K17,'E11'!$B$3:$G$22,6,FALSE)))","v":""},{"$f":"IF(ISNA(VLOOKUP($K17,'E12'!$B$3:$G$22,5,FALSE)),\"\",VLOOKUP($K17,'E12'!$B$3:$G$22,5,FALSE))","v":""},{"$f":"IF(ISNA((VLOOKUP($K17,'E12'!$B$3:$G$22,6,FALSE))),\"\",IF(ISBLANK(VLOOKUP($K17,'E12'!$B$3:$G$22,6,FALSE)),\"\",VLOOKUP($K17,'E12'!$B$3:$G$22,6,FALSE)))","v":""},{"$f":"IF(ISNA(VLOOKUP($K17,'E13'!$B$3:$G$22,5,FALSE)),\"\",VLOOKUP($K17,'E13'!$B$3:$G$22,5,FALSE))","v":""},{"$f":"IF(ISNA((VLOOKUP($K17,'E13'!$B$3:$G$22,6,FALSE))),\"\",IF(ISBLANK(VLOOKUP($K17,'E13'!$B$3:$G$22,6,FALSE)),\"\",VLOOKUP($K17,'E13'!$B$3:$G$22,6,FALSE)))","v":""},{"$f":"IF(ISNA(VLOOKUP($K17,'E14'!$B$3:$G$22,5,FALSE)),\"\",VLOOKUP($K17,'E14'!$B$3:$G$22,5,FALSE))","v":""},{"$f":"IF(ISNA((VLOOKUP($K17,'E14'!$B$3:$G$22,6,FALSE))),\"\",IF(ISBLANK(VLOOKUP($K17,'E14'!$B$3:$G$22,6,FALSE)),\"\",VLOOKUP($K17,'E14'!$B$3:$G$22,6,FALSE)))","v":""},{"$f":"IF(ISNA(VLOOKUP($K17,'E15'!$B$3:$G$22,5,FALSE)),\"\",VLOOKUP($K17,'E15'!$B$3:$G$22,5,FALSE))","v":""},{"$f":"IF(ISNA((VLOOKUP($K17,'E15'!$B$3:$G$22,6,FALSE))),\"\",IF(VLOOKUP($K17,'E15'!$B$3:$G$22,6,FALSE)=0,\"\",VLOOKUP($K17,'E15'!$B$3:$G$22,6,FALSE)))","v":""},{"$f":"IF(ISNA(VLOOKUP($K17,'E16'!$B$3:$G$22,5,FALSE)),\"\",VLOOKUP($K17,'E16'!$B$3:$G$22,5,FALSE))","v":""},{"$f":"IF(ISNA((VLOOKUP($K17,'E16'!$B$3:$G$22,6,FALSE))),\"\",IF(ISBLANK(VLOOKUP($K17,'E16'!$B$3:$G$22,6,FALSE)),\"\",VLOOKUP($K17,'E16'!$B$3:$G$22,6,FALSE)))","v":""},{"$f":"IF(ISNA(VLOOKUP($K17,'E17'!$B$3:$G$22,5,FALSE)),\"\",VLOOKUP($K17,'E17'!$B$3:$G$22,5,FALSE))","v":""},{"$f":"IF(ISNA((VLOOKUP($K17,'E17'!$B$3:$G$22,6,FALSE))),\"\",IF(ISBLANK(VLOOKUP($K17,'E17'!$B$3:$G$22,6,FALSE)),\"\",VLOOKUP($K17,'E17'!$B$3:$G$22,6,FALSE)))","v":""},{"$f":"IF(ISNA(VLOOKUP($K17,'E18'!$B$3:$G$22,5,FALSE)),\"\",VLOOKUP($K17,'E18'!$B$3:$G$22,5,FALSE))","v":""},{"$f":"IF(ISNA((VLOOKUP($K17,'E18'!$B$3:$G$22,6,FALSE))),\"\",IF(ISBLANK(VLOOKUP($K17,'E18'!$B$3:$G$22,6,FALSE)),\"\",VLOOKUP($K17,'E18'!$B$3:$G$22,6,FALSE)))","v":""},{"$f":"IF(ISNA(VLOOKUP($K17,'E19'!$B$3:$G$22,5,FALSE)),\"\",VLOOKUP($K17,'E19'!$B$3:$G$22,5,FALSE))","v":""},{"$f":"IF(ISNA((VLOOKUP($K17,'E19'!$B$3:$G$22,6,FALSE))),\"\",IF(ISBLANK(VLOOKUP($K17,'E19'!$B$3:$G$22,6,FALSE)),\"\",VLOOKUP($K17,'E19'!$B$3:$G$22,6,FALSE)))","v":""},{"$f":"IF(ISNA(VLOOKUP($K17,'E20'!$B$3:$G$22,5,FALSE)),\"\",VLOOKUP($K17,'E20'!$B$3:$G$22,5,FALSE))","v":""},{"$f":"IF(ISNA((VLOOKUP($K17,'E20'!$B$3:$G$22,6,FALSE))),\"\",IF(ISBLANK(VLOOKUP($K17,'E20'!$B$3:$G$22,6,FALSE)),\"\",VLOOKUP($K17,'E20'!$B$3:$G$22,6,FALSE)))","v":""},{"$f":"IF(ISNA(VLOOKUP($K17,'E21'!$B$3:$G$22,5,FALSE)),\"\",VLOOKUP($K17,'E21'!$B$3:$G$22,5,FALSE))","v":""},{"$f":"IF(ISNA((VLOOKUP($K17,'E21'!$B$3:$G$22,6,FALSE))),\"\",IF(ISBLANK(VLOOKUP($K17,'E21'!$B$3:$G$22,6,FALSE)),\"\",VLOOKUP($K17,'E21'!$B$3:$G$22,6,FALSE)))","v":""},{"$f":"IF(ISNA(VLOOKUP($K17,'E22'!$B$3:$G$22,5,FALSE)),\"\",VLOOKUP($K17,'E22'!$B$3:$G$22,5,FALSE))","v":""},{"$f":"IF(ISNA((VLOOKUP($K17,'E22'!$B$3:$G$22,6,FALSE))),\"\",IF(ISBLANK(VLOOKUP($K17,'E22'!$B$3:$G$22,6,FALSE)),\"\",VLOOKUP($K17,'E22'!$B$3:$G$22,6,FALSE)))","v":""},{"$f":"IF(ISNA(VLOOKUP($K17,'E23'!$B$3:$G$22,5,FALSE)),\"\",VLOOKUP($K17,'E23'!$B$3:$G$22,5,FALSE))","v":""},{"$f":"IF(ISNA((VLOOKUP($K17,'E23'!$B$3:$G$22,6,FALSE))),\"\",IF(ISBLANK(VLOOKUP($K17,'E23'!$B$3:$G$22,6,FALSE)),\"\",VLOOKUP($K17,'E23'!$B$3:$G$22,6,FALSE)))","v":""},{"$f":"IF(ISNA(VLOOKUP($K17,'E24'!$B$3:$G$22,5,FALSE)),\"\",VLOOKUP($K17,'E24'!$B$3:$G$22,5,FALSE))","v":""},{"$f":"IF(ISNA((VLOOKUP($K17,'E24'!$B$3:$G$22,6,FALSE))),\"\",IF(ISBLANK(VLOOKUP($K17,'E24'!$B$3:$G$22,6,FALSE)),\"\",VLOOKUP($K17,'E24'!$B$3:$G$22,6,FALSE)))","v":""},{"$f":"IF(ISNA(VLOOKUP($K17,'E25'!$B$3:$G$22,5,FALSE)),\"\",VLOOKUP($K17,'E25'!$B$3:$G$22,5,FALSE))","v":""},{"$f":"IF(ISNA((VLOOKUP($K17,'E25'!$B$3:$G$22,6,FALSE))),\"\",IF(ISBLANK(VLOOKUP($K17,'E25'!$B$3:$G$22,6,FALSE)),\"\",VLOOKUP($K17,'E25'!$B$3:$G$22,6,FALSE)))","v":""},{"$f":"IF(ISNA(VLOOKUP($K17,'E26'!$B$3:$G$22,5,FALSE)),\"\",VLOOKUP($K17,'E26'!$B$3:$G$22,5,FALSE))","v":""},{"$f":"IF(ISNA((VLOOKUP($K17,'E26'!$B$3:$G$22,6,FALSE))),\"\",IF(ISBLANK(VLOOKUP($K17,'E26'!$B$3:$G$22,6,FALSE)),\"\",VLOOKUP($K17,'E26'!$B$3:$G$22,6,FALSE)))","v":""},{"$f":"IF(ISNA(VLOOKUP($K17,'E27'!$B$3:$G$22,5,FALSE)),\"\",VLOOKUP($K17,'E27'!$B$3:$G$22,5,FALSE))","v":""},{"$f":"IF(ISNA((VLOOKUP($K17,'E27'!$B$3:$G$22,6,FALSE))),\"\",IF(ISBLANK(VLOOKUP($K17,'E27'!$B$3:$G$22,6,FALSE)),\"\",VLOOKUP($K17,'E27'!$B$3:$G$22,6,FALSE)))","v":""},{"$f":"IF(ISNA(VLOOKUP($K17,'E28'!$B$3:$G$22,5,FALSE)),\"\",VLOOKUP($K17,'E28'!$B$3:$G$22,5,FALSE))","v":""},{"$f":"IF(ISNA((VLOOKUP($K17,'E28'!$B$3:$G$22,6,FALSE))),\"\",IF(ISBLANK(VLOOKUP($K17,'E28'!$B$3:$G$22,6,FALSE)),\"\",VLOOKUP($K17,'E28'!$B$3:$G$22,6,FALSE)))","v":""},{"$f":"IF(ISNA(VLOOKUP($K17,'E29'!$B$3:$G$22,5,FALSE)),\"\",VLOOKUP($K17,'E29'!$B$3:$G$22,5,FALSE))","v":""},{"$f":"IF(ISNA((VLOOKUP($K17,'E29'!$B$3:$G$22,6,FALSE))),\"\",IF(ISBLANK(VLOOKUP($K17,'E29'!$B$3:$G$22,6,FALSE)),\"\",VLOOKUP($K17,'E29'!$B$3:$G$22,6,FALSE)))","v":""},{"$f":"IF(ISNA(VLOOKUP($K17,'E30'!$B$3:$G$22,5,FALSE)),\"\",VLOOKUP($K17,'E30'!$B$3:$G$22,5,FALSE))","v":""},{"$f":"IF(ISNA((VLOOKUP($K17,'E30'!$B$3:$G$22,6,FALSE))),\"\",IF(ISBLANK(VLOOKUP($K17,'E30'!$B$3:$G$22,6,FALSE)),\"\",VLOOKUP($K17,'E30'!$B$3:$G$22,6,FALSE)))","v":""}]
["E14",{"$f":"CONCATENATE('Liste classe'!E16,\" \",'Liste classe'!F16,\" \",'Liste classe'!G16,\" \",'Liste classe'!H16,\" \",'Liste classe'!I16,\" \",'Liste classe'!J16)","v":"     "},{"$f":"'E14'!$F$24","v":"00:00:00"},{"$f":"'E14'!$F$26","v":" "},{"$f":"'E14'!$G$28","v":0},{"$f":"'E14'!$I$28","v":0},{"$f":"COUNTA('E14'!$D$3:$D$22)","v":0},null,null,null,{"$f":"IF(ISBLANK(Circuits!B13),\"\",Circuits!B13)","v":""},{"$f":"IF(ISBLANK(Circuits!C13),\"\",Circuits!C13)","v":""},"","",{"$f":"IF(ISNA(VLOOKUP($K18,'E1'!$B$3:$G$22,5,FALSE)),\"\",VLOOKUP($K18,'E1'!$B$3:$G$22,5,FALSE))","v":""},{"$f":"IF(ISNA((VLOOKUP($K18,'E1'!$B$3:$G$22,6,FALSE))),\"\",IF(ISBLANK(VLOOKUP($K18,'E1'!$B$3:$G$22,6,FALSE)),\"\",VLOOKUP($K18,'E1'!$B$3:$G$22,6,FALSE)))","v":""},{"$f":"IF(ISNA(VLOOKUP($K18,'E2'!$B$3:$G$22,5,FALSE)),\"\",VLOOKUP($K18,'E2'!$B$3:$G$22,5,FALSE))","v":""},{"$f":"IF(ISNA((VLOOKUP($K18,'E2'!$B$3:$G$22,6,FALSE))),\"\",IF(ISBLANK(VLOOKUP($K18,'E2'!$B$3:$G$22,6,FALSE)),\"\",VLOOKUP($K18,'E2'!$B$3:$G$22,6,FALSE)))","v":""},{"$f":"IF(ISNA(VLOOKUP($K18,'E3'!$B$3:$G$22,5,FALSE)),\"\",VLOOKUP($K18,'E3'!$B$3:$G$22,5,FALSE))","v":""},{"$f":"IF(ISNA((VLOOKUP($K18,'E3'!$B$3:$G$22,6,FALSE))),\"\",IF(ISBLANK(VLOOKUP($K18,'E3'!$B$3:$G$22,6,FALSE)),\"\",VLOOKUP($K18,'E3'!$B$3:$G$22,6,FALSE)))","v":""},{"$f":"IF(ISNA(VLOOKUP($K18,'E4'!$B$3:$G$22,5,FALSE)),\"\",VLOOKUP($K18,'E4'!$B$3:$G$22,5,FALSE))","v":""},{"$f":"IF(ISNA((VLOOKUP($K18,'E4'!$B$3:$G$22,6,FALSE))),\"\",IF(ISBLANK(VLOOKUP($K18,'E4'!$B$3:$G$22,6,FALSE)),\"\",VLOOKUP($K18,'E4'!$B$3:$G$22,6,FALSE)))","v":""},{"$f":"IF(ISNA(VLOOKUP($K18,'E5'!$B$3:$G$22,5,FALSE)),\"\",VLOOKUP($K18,'E5'!$B$3:$G$22,5,FALSE))","v":""},{"$f":"IF(ISNA((VLOOKUP($K18,'E5'!$B$3:$G$22,6,FALSE))),\"\",IF(ISBLANK(VLOOKUP($K18,'E5'!$B$3:$G$22,6,FALSE)),\"\",VLOOKUP($K18,'E5'!$B$3:$G$22,6,FALSE)))","v":""},{"$f":"IF(ISNA(VLOOKUP($K18,'E6'!$B$3:$G$22,5,FALSE)),\"\",VLOOKUP($K18,'E6'!$B$3:$G$22,5,FALSE))","v":""},{"$f":"IF(ISNA((VLOOKUP($K18,'E6'!$B$3:$G$22,6,FALSE))),\"\",IF(ISBLANK(VLOOKUP($K18,'E6'!$B$3:$G$22,6,FALSE)),\"\",VLOOKUP($K18,'E6'!$B$3:$G$22,6,FALSE)))","v":""},{"$f":"IF(ISNA(VLOOKUP($K18,'E7'!$B$3:$G$22,5,FALSE)),\"\",VLOOKUP($K18,'E7'!$B$3:$G$22,5,FALSE))","v":""},{"$f":"IF(ISNA((VLOOKUP($K18,'E7'!$B$3:$G$22,6,FALSE))),\"\",IF(ISBLANK(VLOOKUP($K18,'E7'!$B$3:$G$22,6,FALSE)),\"\",VLOOKUP($K18,'E7'!$B$3:$G$22,6,FALSE)))","v":""},{"$f":"IF(ISNA(VLOOKUP($K18,'E8'!$B$3:$G$22,5,FALSE)),\"\",VLOOKUP($K18,'E8'!$B$3:$G$22,5,FALSE))","v":""},{"$f":"IF(ISNA((VLOOKUP($K18,'E8'!$B$3:$G$22,6,FALSE))),\"\",IF(ISBLANK(VLOOKUP($K18,'E8'!$B$3:$G$22,6,FALSE)),\"\",VLOOKUP($K18,'E8'!$B$3:$G$22,6,FALSE)))","v":""},{"$f":"IF(ISNA(VLOOKUP($K18,'E9'!$B$3:$G$22,5,FALSE)),\"\",VLOOKUP($K18,'E9'!$B$3:$G$22,5,FALSE))","v":""},{"$f":"IF(ISNA((VLOOKUP($K18,'E9'!$B$3:$G$22,6,FALSE))),\"\",IF(ISBLANK(VLOOKUP($K18,'E9'!$B$3:$G$22,6,FALSE)),\"\",VLOOKUP($K18,'E9'!$B$3:$G$22,6,FALSE)))","v":""},{"$f":"IF(ISNA(VLOOKUP($K18,'E10'!$B$3:$G$22,5,FALSE)),\"\",VLOOKUP($K18,'E10'!$B$3:$G$22,5,FALSE))","v":""},{"$f":"IF(ISNA((VLOOKUP($K18,'E10'!$B$3:$G$22,6,FALSE))),\"\",IF(ISBLANK(VLOOKUP($K18,'E10'!$B$3:$G$22,6,FALSE)),\"\",VLOOKUP($K18,'E10'!$B$3:$G$22,6,FALSE)))","v":""},{"$f":"IF(ISNA(VLOOKUP($K18,'E11'!$B$3:$G$22,5,FALSE)),\"\",VLOOKUP($K18,'E11'!$B$3:$G$22,5,FALSE))","v":""},{"$f":"IF(ISNA((VLOOKUP($K18,'E11'!$B$3:$G$22,6,FALSE))),\"\",IF(ISBLANK(VLOOKUP($K18,'E11'!$B$3:$G$22,6,FALSE)),\"\",VLOOKUP($K18,'E11'!$B$3:$G$22,6,FALSE)))","v":""},{"$f":"IF(ISNA(VLOOKUP($K18,'E12'!$B$3:$G$22,5,FALSE)),\"\",VLOOKUP($K18,'E12'!$B$3:$G$22,5,FALSE))","v":""},{"$f":"IF(ISNA((VLOOKUP($K18,'E12'!$B$3:$G$22,6,FALSE))),\"\",IF(ISBLANK(VLOOKUP($K18,'E12'!$B$3:$G$22,6,FALSE)),\"\",VLOOKUP($K18,'E12'!$B$3:$G$22,6,FALSE)))","v":""},{"$f":"IF(ISNA(VLOOKUP($K18,'E13'!$B$3:$G$22,5,FALSE)),\"\",VLOOKUP($K18,'E13'!$B$3:$G$22,5,FALSE))","v":""},{"$f":"IF(ISNA((VLOOKUP($K18,'E13'!$B$3:$G$22,6,FALSE))),\"\",IF(ISBLANK(VLOOKUP($K18,'E13'!$B$3:$G$22,6,FALSE)),\"\",VLOOKUP($K18,'E13'!$B$3:$G$22,6,FALSE)))","v":""},{"$f":"IF(ISNA(VLOOKUP($K18,'E14'!$B$3:$G$22,5,FALSE)),\"\",VLOOKUP($K18,'E14'!$B$3:$G$22,5,FALSE))","v":""},{"$f":"IF(ISNA((VLOOKUP($K18,'E14'!$B$3:$G$22,6,FALSE))),\"\",IF(ISBLANK(VLOOKUP($K18,'E14'!$B$3:$G$22,6,FALSE)),\"\",VLOOKUP($K18,'E14'!$B$3:$G$22,6,FALSE)))","v":""},{"$f":"IF(ISNA(VLOOKUP($K18,'E15'!$B$3:$G$22,5,FALSE)),\"\",VLOOKUP($K18,'E15'!$B$3:$G$22,5,FALSE))","v":""},{"$f":"IF(ISNA((VLOOKUP($K18,'E15'!$B$3:$G$22,6,FALSE))),\"\",IF(VLOOKUP($K18,'E15'!$B$3:$G$22,6,FALSE)=0,\"\",VLOOKUP($K18,'E15'!$B$3:$G$22,6,FALSE)))","v":""},{"$f":"IF(ISNA(VLOOKUP($K18,'E16'!$B$3:$G$22,5,FALSE)),\"\",VLOOKUP($K18,'E16'!$B$3:$G$22,5,FALSE))","v":""},{"$f":"IF(ISNA((VLOOKUP($K18,'E16'!$B$3:$G$22,6,FALSE))),\"\",IF(ISBLANK(VLOOKUP($K18,'E16'!$B$3:$G$22,6,FALSE)),\"\",VLOOKUP($K18,'E16'!$B$3:$G$22,6,FALSE)))","v":""},{"$f":"IF(ISNA(VLOOKUP($K18,'E17'!$B$3:$G$22,5,FALSE)),\"\",VLOOKUP($K18,'E17'!$B$3:$G$22,5,FALSE))","v":""},{"$f":"IF(ISNA((VLOOKUP($K18,'E17'!$B$3:$G$22,6,FALSE))),\"\",IF(ISBLANK(VLOOKUP($K18,'E17'!$B$3:$G$22,6,FALSE)),\"\",VLOOKUP($K18,'E17'!$B$3:$G$22,6,FALSE)))","v":""},{"$f":"IF(ISNA(VLOOKUP($K18,'E18'!$B$3:$G$22,5,FALSE)),\"\",VLOOKUP($K18,'E18'!$B$3:$G$22,5,FALSE))","v":""},{"$f":"IF(ISNA((VLOOKUP($K18,'E18'!$B$3:$G$22,6,FALSE))),\"\",IF(ISBLANK(VLOOKUP($K18,'E18'!$B$3:$G$22,6,FALSE)),\"\",VLOOKUP($K18,'E18'!$B$3:$G$22,6,FALSE)))","v":""},{"$f":"IF(ISNA(VLOOKUP($K18,'E19'!$B$3:$G$22,5,FALSE)),\"\",VLOOKUP($K18,'E19'!$B$3:$G$22,5,FALSE))","v":""},{"$f":"IF(ISNA((VLOOKUP($K18,'E19'!$B$3:$G$22,6,FALSE))),\"\",IF(ISBLANK(VLOOKUP($K18,'E19'!$B$3:$G$22,6,FALSE)),\"\",VLOOKUP($K18,'E19'!$B$3:$G$22,6,FALSE)))","v":""},{"$f":"IF(ISNA(VLOOKUP($K18,'E20'!$B$3:$G$22,5,FALSE)),\"\",VLOOKUP($K18,'E20'!$B$3:$G$22,5,FALSE))","v":""},{"$f":"IF(ISNA((VLOOKUP($K18,'E20'!$B$3:$G$22,6,FALSE))),\"\",IF(ISBLANK(VLOOKUP($K18,'E20'!$B$3:$G$22,6,FALSE)),\"\",VLOOKUP($K18,'E20'!$B$3:$G$22,6,FALSE)))","v":""},{"$f":"IF(ISNA(VLOOKUP($K18,'E21'!$B$3:$G$22,5,FALSE)),\"\",VLOOKUP($K18,'E21'!$B$3:$G$22,5,FALSE))","v":""},{"$f":"IF(ISNA((VLOOKUP($K18,'E21'!$B$3:$G$22,6,FALSE))),\"\",IF(ISBLANK(VLOOKUP($K18,'E21'!$B$3:$G$22,6,FALSE)),\"\",VLOOKUP($K18,'E21'!$B$3:$G$22,6,FALSE)))","v":""},{"$f":"IF(ISNA(VLOOKUP($K18,'E22'!$B$3:$G$22,5,FALSE)),\"\",VLOOKUP($K18,'E22'!$B$3:$G$22,5,FALSE))","v":""},{"$f":"IF(ISNA((VLOOKUP($K18,'E22'!$B$3:$G$22,6,FALSE))),\"\",IF(ISBLANK(VLOOKUP($K18,'E22'!$B$3:$G$22,6,FALSE)),\"\",VLOOKUP($K18,'E22'!$B$3:$G$22,6,FALSE)))","v":""},{"$f":"IF(ISNA(VLOOKUP($K18,'E23'!$B$3:$G$22,5,FALSE)),\"\",VLOOKUP($K18,'E23'!$B$3:$G$22,5,FALSE))","v":""},{"$f":"IF(ISNA((VLOOKUP($K18,'E23'!$B$3:$G$22,6,FALSE))),\"\",IF(ISBLANK(VLOOKUP($K18,'E23'!$B$3:$G$22,6,FALSE)),\"\",VLOOKUP($K18,'E23'!$B$3:$G$22,6,FALSE)))","v":""},{"$f":"IF(ISNA(VLOOKUP($K18,'E24'!$B$3:$G$22,5,FALSE)),\"\",VLOOKUP($K18,'E24'!$B$3:$G$22,5,FALSE))","v":""},{"$f":"IF(ISNA((VLOOKUP($K18,'E24'!$B$3:$G$22,6,FALSE))),\"\",IF(ISBLANK(VLOOKUP($K18,'E24'!$B$3:$G$22,6,FALSE)),\"\",VLOOKUP($K18,'E24'!$B$3:$G$22,6,FALSE)))","v":""},{"$f":"IF(ISNA(VLOOKUP($K18,'E25'!$B$3:$G$22,5,FALSE)),\"\",VLOOKUP($K18,'E25'!$B$3:$G$22,5,FALSE))","v":""},{"$f":"IF(ISNA((VLOOKUP($K18,'E25'!$B$3:$G$22,6,FALSE))),\"\",IF(ISBLANK(VLOOKUP($K18,'E25'!$B$3:$G$22,6,FALSE)),\"\",VLOOKUP($K18,'E25'!$B$3:$G$22,6,FALSE)))","v":""},{"$f":"IF(ISNA(VLOOKUP($K18,'E26'!$B$3:$G$22,5,FALSE)),\"\",VLOOKUP($K18,'E26'!$B$3:$G$22,5,FALSE))","v":""},{"$f":"IF(ISNA((VLOOKUP($K18,'E26'!$B$3:$G$22,6,FALSE))),\"\",IF(ISBLANK(VLOOKUP($K18,'E26'!$B$3:$G$22,6,FALSE)),\"\",VLOOKUP($K18,'E26'!$B$3:$G$22,6,FALSE)))","v":""},{"$f":"IF(ISNA(VLOOKUP($K18,'E27'!$B$3:$G$22,5,FALSE)),\"\",VLOOKUP($K18,'E27'!$B$3:$G$22,5,FALSE))","v":""},{"$f":"IF(ISNA((VLOOKUP($K18,'E27'!$B$3:$G$22,6,FALSE))),\"\",IF(ISBLANK(VLOOKUP($K18,'E27'!$B$3:$G$22,6,FALSE)),\"\",VLOOKUP($K18,'E27'!$B$3:$G$22,6,FALSE)))","v":""},{"$f":"IF(ISNA(VLOOKUP($K18,'E28'!$B$3:$G$22,5,FALSE)),\"\",VLOOKUP($K18,'E28'!$B$3:$G$22,5,FALSE))","v":""},{"$f":"IF(ISNA((VLOOKUP($K18,'E28'!$B$3:$G$22,6,FALSE))),\"\",IF(ISBLANK(VLOOKUP($K18,'E28'!$B$3:$G$22,6,FALSE)),\"\",VLOOKUP($K18,'E28'!$B$3:$G$22,6,FALSE)))","v":""},{"$f":"IF(ISNA(VLOOKUP($K18,'E29'!$B$3:$G$22,5,FALSE)),\"\",VLOOKUP($K18,'E29'!$B$3:$G$22,5,FALSE))","v":""},{"$f":"IF(ISNA((VLOOKUP($K18,'E29'!$B$3:$G$22,6,FALSE))),\"\",IF(ISBLANK(VLOOKUP($K18,'E29'!$B$3:$G$22,6,FALSE)),\"\",VLOOKUP($K18,'E29'!$B$3:$G$22,6,FALSE)))","v":""},{"$f":"IF(ISNA(VLOOKUP($K18,'E30'!$B$3:$G$22,5,FALSE)),\"\",VLOOKUP($K18,'E30'!$B$3:$G$22,5,FALSE))","v":""},{"$f":"IF(ISNA((VLOOKUP($K18,'E30'!$B$3:$G$22,6,FALSE))),\"\",IF(ISBLANK(VLOOKUP($K18,'E30'!$B$3:$G$22,6,FALSE)),\"\",VLOOKUP($K18,'E30'!$B$3:$G$22,6,FALSE)))","v":""}]
["E15",{"$f":"CONCATENATE('Liste classe'!E17,\" \",'Liste classe'!F17,\" \",'Liste classe'!G17,\" \",'Liste classe'!H17,\" \",'Liste classe'!I17,\" \",'Liste classe'!J17)","v":"     "},{"$f":"'E15'!$F$24","v":"00:00:00"},{"$f":"'E15'!$F$26","v":" "},{"$f":"'E15'!$G$28","v":0},{"$f":"'E15'!$I$28","v":0},{"$f":"COUNTA('E15'!$D$3:$D$22)","v":0},null,null,null,{"$f":"IF(ISBLANK(Circuits!B14),\"\",Circuits!B14)","v":""},{"$f":"IF(ISBLANK(Circuits!C14),\"\",Circuits!C14)","v":""},"","",{"$f":"IF(ISNA(VLOOKUP($K19,'E1'!$B$3:$G$22,5,FALSE)),\"\",VLOOKUP($K19,'E1'!$B$3:$G$22,5,FALSE))","v":""},{"$f":"IF(ISNA((VLOOKUP($K19,'E1'!$B$3:$G$22,6,FALSE))),\"\",IF(ISBLANK(VLOOKUP($K19,'E1'!$B$3:$G$22,6,FALSE)),\"\",VLOOKUP($K19,'E1'!$B$3:$G$22,6,FALSE)))","v":""},{"$f":"IF(ISNA(VLOOKUP($K19,'E2'!$B$3:$G$22,5,FALSE)),\"\",VLOOKUP($K19,'E2'!$B$3:$G$22,5,FALSE))","v":""},{"$f":"IF(ISNA((VLOOKUP($K19,'E2'!$B$3:$G$22,6,FALSE))),\"\",IF(ISBLANK(VLOOKUP($K19,'E2'!$B$3:$G$22,6,FALSE)),\"\",VLOOKUP($K19,'E2'!$B$3:$G$22,6,FALSE)))","v":""},{"$f":"IF(ISNA(VLOOKUP($K19,'E3'!$B$3:$G$22,5,FALSE)),\"\",VLOOKUP($K19,'E3'!$B$3:$G$22,5,FALSE))","v":""},{"$f":"IF(ISNA((VLOOKUP($K19,'E3'!$B$3:$G$22,6,FALSE))),\"\",IF(ISBLANK(VLOOKUP($K19,'E3'!$B$3:$G$22,6,FALSE)),\"\",VLOOKUP($K19,'E3'!$B$3:$G$22,6,FALSE)))","v":""},{"$f":"IF(ISNA(VLOOKUP($K19,'E4'!$B$3:$G$22,5,FALSE)),\"\",VLOOKUP($K19,'E4'!$B$3:$G$22,5,FALSE))","v":""},{"$f":"IF(ISNA((VLOOKUP($K19,'E4'!$B$3:$G$22,6,FALSE))),\"\",IF(ISBLANK(VLOOKUP($K19,'E4'!$B$3:$G$22,6,FALSE)),\"\",VLOOKUP($K19,'E4'!$B$3:$G$22,6,FALSE)))","v":""},{"$f":"IF(ISNA(VLOOKUP($K19,'E5'!$B$3:$G$22,5,FALSE)),\"\",VLOOKUP($K19,'E5'!$B$3:$G$22,5,FALSE))","v":""},{"$f":"IF(ISNA((VLOOKUP($K19,'E5'!$B$3:$G$22,6,FALSE))),\"\",IF(ISBLANK(VLOOKUP($K19,'E5'!$B$3:$G$22,6,FALSE)),\"\",VLOOKUP($K19,'E5'!$B$3:$G$22,6,FALSE)))","v":""},{"$f":"IF(ISNA(VLOOKUP($K19,'E6'!$B$3:$G$22,5,FALSE)),\"\",VLOOKUP($K19,'E6'!$B$3:$G$22,5,FALSE))","v":""},{"$f":"IF(ISNA((VLOOKUP($K19,'E6'!$B$3:$G$22,6,FALSE))),\"\",IF(ISBLANK(VLOOKUP($K19,'E6'!$B$3:$G$22,6,FALSE)),\"\",VLOOKUP($K19,'E6'!$B$3:$G$22,6,FALSE)))","v":""},{"$f":"IF(ISNA(VLOOKUP($K19,'E7'!$B$3:$G$22,5,FALSE)),\"\",VLOOKUP($K19,'E7'!$B$3:$G$22,5,FALSE))","v":""},{"$f":"IF(ISNA((VLOOKUP($K19,'E7'!$B$3:$G$22,6,FALSE))),\"\",IF(ISBLANK(VLOOKUP($K19,'E7'!$B$3:$G$22,6,FALSE)),\"\",VLOOKUP($K19,'E7'!$B$3:$G$22,6,FALSE)))","v":""},{"$f":"IF(ISNA(VLOOKUP($K19,'E8'!$B$3:$G$22,5,FALSE)),\"\",VLOOKUP($K19,'E8'!$B$3:$G$22,5,FALSE))","v":""},{"$f":"IF(ISNA((VLOOKUP($K19,'E8'!$B$3:$G$22,6,FALSE))),\"\",IF(ISBLANK(VLOOKUP($K19,'E8'!$B$3:$G$22,6,FALSE)),\"\",VLOOKUP($K19,'E8'!$B$3:$G$22,6,FALSE)))","v":""},{"$f":"IF(ISNA(VLOOKUP($K19,'E9'!$B$3:$G$22,5,FALSE)),\"\",VLOOKUP($K19,'E9'!$B$3:$G$22,5,FALSE))","v":""},{"$f":"IF(ISNA((VLOOKUP($K19,'E9'!$B$3:$G$22,6,FALSE))),\"\",IF(ISBLANK(VLOOKUP($K19,'E9'!$B$3:$G$22,6,FALSE)),\"\",VLOOKUP($K19,'E9'!$B$3:$G$22,6,FALSE)))","v":""},{"$f":"IF(ISNA(VLOOKUP($K19,'E10'!$B$3:$G$22,5,FALSE)),\"\",VLOOKUP($K19,'E10'!$B$3:$G$22,5,FALSE))","v":""},{"$f":"IF(ISNA((VLOOKUP($K19,'E10'!$B$3:$G$22,6,FALSE))),\"\",IF(ISBLANK(VLOOKUP($K19,'E10'!$B$3:$G$22,6,FALSE)),\"\",VLOOKUP($K19,'E10'!$B$3:$G$22,6,FALSE)))","v":""},{"$f":"IF(ISNA(VLOOKUP($K19,'E11'!$B$3:$G$22,5,FALSE)),\"\",VLOOKUP($K19,'E11'!$B$3:$G$22,5,FALSE))","v":""},{"$f":"IF(ISNA((VLOOKUP($K19,'E11'!$B$3:$G$22,6,FALSE))),\"\",IF(ISBLANK(VLOOKUP($K19,'E11'!$B$3:$G$22,6,FALSE)),\"\",VLOOKUP($K19,'E11'!$B$3:$G$22,6,FALSE)))","v":""},{"$f":"IF(ISNA(VLOOKUP($K19,'E12'!$B$3:$G$22,5,FALSE)),\"\",VLOOKUP($K19,'E12'!$B$3:$G$22,5,FALSE))","v":""},{"$f":"IF(ISNA((VLOOKUP($K19,'E12'!$B$3:$G$22,6,FALSE))),\"\",IF(ISBLANK(VLOOKUP($K19,'E12'!$B$3:$G$22,6,FALSE)),\"\",VLOOKUP($K19,'E12'!$B$3:$G$22,6,FALSE)))","v":""},{"$f":"IF(ISNA(VLOOKUP($K19,'E13'!$B$3:$G$22,5,FALSE)),\"\",VLOOKUP($K19,'E13'!$B$3:$G$22,5,FALSE))","v":""},{"$f":"IF(ISNA((VLOOKUP($K19,'E13'!$B$3:$G$22,6,FALSE))),\"\",IF(ISBLANK(VLOOKUP($K19,'E13'!$B$3:$G$22,6,FALSE)),\"\",VLOOKUP($K19,'E13'!$B$3:$G$22,6,FALSE)))","v":""},{"$f":"IF(ISNA(VLOOKUP($K19,'E14'!$B$3:$G$22,5,FALSE)),\"\",VLOOKUP($K19,'E14'!$B$3:$G$22,5,FALSE))","v":""},{"$f":"IF(ISNA((VLOOKUP($K19,'E14'!$B$3:$G$22,6,FALSE))),\"\",IF(ISBLANK(VLOOKUP($K19,'E14'!$B$3:$G$22,6,FALSE)),\"\",VLOOKUP($K19,'E14'!$B$3:$G$22,6,FALSE)))","v":""},{"$f":"IF(ISNA(VLOOKUP($K19,'E15'!$B$3:$G$22,5,FALSE)),\"\",VLOOKUP($K19,'E15'!$B$3:$G$22,5,FALSE))","v":""},{"$f":"IF(ISNA((VLOOKUP($K19,'E15'!$B$3:$G$22,6,FALSE))),\"\",IF(VLOOKUP($K19,'E15'!$B$3:$G$22,6,FALSE)=0,\"\",VLOOKUP($K19,'E15'!$B$3:$G$22,6,FALSE)))","v":""},{"$f":"IF(ISNA(VLOOKUP($K19,'E16'!$B$3:$G$22,5,FALSE)),\"\",VLOOKUP($K19,'E16'!$B$3:$G$22,5,FALSE))","v":""},{"$f":"IF(ISNA((VLOOKUP($K19,'E16'!$B$3:$G$22,6,FALSE))),\"\",IF(ISBLANK(VLOOKUP($K19,'E16'!$B$3:$G$22,6,FALSE)),\"\",VLOOKUP($K19,'E16'!$B$3:$G$22,6,FALSE)))","v":""},{"$f":"IF(ISNA(VLOOKUP($K19,'E17'!$B$3:$G$22,5,FALSE)),\"\",VLOOKUP($K19,'E17'!$B$3:$G$22,5,FALSE))","v":""},{"$f":"IF(ISNA((VLOOKUP($K19,'E17'!$B$3:$G$22,6,FALSE))),\"\",IF(ISBLANK(VLOOKUP($K19,'E17'!$B$3:$G$22,6,FALSE)),\"\",VLOOKUP($K19,'E17'!$B$3:$G$22,6,FALSE)))","v":""},{"$f":"IF(ISNA(VLOOKUP($K19,'E18'!$B$3:$G$22,5,FALSE)),\"\",VLOOKUP($K19,'E18'!$B$3:$G$22,5,FALSE))","v":""},{"$f":"IF(ISNA((VLOOKUP($K19,'E18'!$B$3:$G$22,6,FALSE))),\"\",IF(ISBLANK(VLOOKUP($K19,'E18'!$B$3:$G$22,6,FALSE)),\"\",VLOOKUP($K19,'E18'!$B$3:$G$22,6,FALSE)))","v":""},{"$f":"IF(ISNA(VLOOKUP($K19,'E19'!$B$3:$G$22,5,FALSE)),\"\",VLOOKUP($K19,'E19'!$B$3:$G$22,5,FALSE))","v":""},{"$f":"IF(ISNA((VLOOKUP($K19,'E19'!$B$3:$G$22,6,FALSE))),\"\",IF(ISBLANK(VLOOKUP($K19,'E19'!$B$3:$G$22,6,FALSE)),\"\",VLOOKUP($K19,'E19'!$B$3:$G$22,6,FALSE)))","v":""},{"$f":"IF(ISNA(VLOOKUP($K19,'E20'!$B$3:$G$22,5,FALSE)),\"\",VLOOKUP($K19,'E20'!$B$3:$G$22,5,FALSE))","v":""},{"$f":"IF(ISNA((VLOOKUP($K19,'E20'!$B$3:$G$22,6,FALSE))),\"\",IF(ISBLANK(VLOOKUP($K19,'E20'!$B$3:$G$22,6,FALSE)),\"\",VLOOKUP($K19,'E20'!$B$3:$G$22,6,FALSE)))","v":""},{"$f":"IF(ISNA(VLOOKUP($K19,'E21'!$B$3:$G$22,5,FALSE)),\"\",VLOOKUP($K19,'E21'!$B$3:$G$22,5,FALSE))","v":""},{"$f":"IF(ISNA((VLOOKUP($K19,'E21'!$B$3:$G$22,6,FALSE))),\"\",IF(ISBLANK(VLOOKUP($K19,'E21'!$B$3:$G$22,6,FALSE)),\"\",VLOOKUP($K19,'E21'!$B$3:$G$22,6,FALSE)))","v":""},{"$f":"IF(ISNA(VLOOKUP($K19,'E22'!$B$3:$G$22,5,FALSE)),\"\",VLOOKUP($K19,'E22'!$B$3:$G$22,5,FALSE))","v":""},{"$f":"IF(ISNA((VLOOKUP($K19,'E22'!$B$3:$G$22,6,FALSE))),\"\",IF(ISBLANK(VLOOKUP($K19,'E22'!$B$3:$G$22,6,FALSE)),\"\",VLOOKUP($K19,'E22'!$B$3:$G$22,6,FALSE)))","v":""},{"$f":"IF(ISNA(VLOOKUP($K19,'E23'!$B$3:$G$22,5,FALSE)),\"\",VLOOKUP($K19,'E23'!$B$3:$G$22,5,FALSE))","v":""},{"$f":"IF(ISNA((VLOOKUP($K19,'E23'!$B$3:$G$22,6,FALSE))),\"\",IF(ISBLANK(VLOOKUP($K19,'E23'!$B$3:$G$22,6,FALSE)),\"\",VLOOKUP($K19,'E23'!$B$3:$G$22,6,FALSE)))","v":""},{"$f":"IF(ISNA(VLOOKUP($K19,'E24'!$B$3:$G$22,5,FALSE)),\"\",VLOOKUP($K19,'E24'!$B$3:$G$22,5,FALSE))","v":""},{"$f":"IF(ISNA((VLOOKUP($K19,'E24'!$B$3:$G$22,6,FALSE))),\"\",IF(ISBLANK(VLOOKUP($K19,'E24'!$B$3:$G$22,6,FALSE)),\"\",VLOOKUP($K19,'E24'!$B$3:$G$22,6,FALSE)))","v":""},{"$f":"IF(ISNA(VLOOKUP($K19,'E25'!$B$3:$G$22,5,FALSE)),\"\",VLOOKUP($K19,'E25'!$B$3:$G$22,5,FALSE))","v":""},{"$f":"IF(ISNA((VLOOKUP($K19,'E25'!$B$3:$G$22,6,FALSE))),\"\",IF(ISBLANK(VLOOKUP($K19,'E25'!$B$3:$G$22,6,FALSE)),\"\",VLOOKUP($K19,'E25'!$B$3:$G$22,6,FALSE)))","v":""},{"$f":"IF(ISNA(VLOOKUP($K19,'E26'!$B$3:$G$22,5,FALSE)),\"\",VLOOKUP($K19,'E26'!$B$3:$G$22,5,FALSE))","v":""},{"$f":"IF(ISNA((VLOOKUP($K19,'E26'!$B$3:$G$22,6,FALSE))),\"\",IF(ISBLANK(VLOOKUP($K19,'E26'!$B$3:$G$22,6,FALSE)),\"\",VLOOKUP($K19,'E26'!$B$3:$G$22,6,FALSE)))","v":""},{"$f":"IF(ISNA(VLOOKUP($K19,'E27'!$B$3:$G$22,5,FALSE)),\"\",VLOOKUP($K19,'E27'!$B$3:$G$22,5,FALSE))","v":""},{"$f":"IF(ISNA((VLOOKUP($K19,'E27'!$B$3:$G$22,6,FALSE))),\"\",IF(ISBLANK(VLOOKUP($K19,'E27'!$B$3:$G$22,6,FALSE)),\"\",VLOOKUP($K19,'E27'!$B$3:$G$22,6,FALSE)))","v":""},{"$f":"IF(ISNA(VLOOKUP($K19,'E28'!$B$3:$G$22,5,FALSE)),\"\",VLOOKUP($K19,'E28'!$B$3:$G$22,5,FALSE))","v":""},{"$f":"IF(ISNA((VLOOKUP($K19,'E28'!$B$3:$G$22,6,FALSE))),\"\",IF(ISBLANK(VLOOKUP($K19,'E28'!$B$3:$G$22,6,FALSE)),\"\",VLOOKUP($K19,'E28'!$B$3:$G$22,6,FALSE)))","v":""},{"$f":"IF(ISNA(VLOOKUP($K19,'E29'!$B$3:$G$22,5,FALSE)),\"\",VLOOKUP($K19,'E29'!$B$3:$G$22,5,FALSE))","v":""},{"$f":"IF(ISNA((VLOOKUP($K19,'E29'!$B$3:$G$22,6,FALSE))),\"\",IF(ISBLANK(VLOOKUP($K19,'E29'!$B$3:$G$22,6,FALSE)),\"\",VLOOKUP($K19,'E29'!$B$3:$G$22,6,FALSE)))","v":""},{"$f":"IF(ISNA(VLOOKUP($K19,'E30'!$B$3:$G$22,5,FALSE)),\"\",VLOOKUP($K19,'E30'!$B$3:$G$22,5,FALSE))","v":""},{"$f":"IF(ISNA((VLOOKUP($K19,'E30'!$B$3:$G$22,6,FALSE))),\"\",IF(ISBLANK(VLOOKUP($K19,'E30'!$B$3:$G$22,6,FALSE)),\"\",VLOOKUP($K19,'E30'!$B$3:$G$22,6,FALSE)))","v":""}]
["E16",{"$f":"CONCATENATE('Liste classe'!E18,\" \",'Liste classe'!F18,\" \",'Liste classe'!G18,\" \",'Liste classe'!H18,\" \",'Liste classe'!I18,\" \",'Liste classe'!J18)","v":"     "},{"$f":"'E16'!$F$24","v":"00:00:00"},{"$f":"'E16'!$F$26","v":" "},{"$f":"'E16'!$G$28","v":0},{"$f":"'E16'!$I$28","v":0},{"$f":"COUNTA('E16'!$D$3:$D$22)","v":0},null,null,null,{"$f":"IF(ISBLANK(Circuits!B15),\"\",Circuits!B15)","v":""},{"$f":"IF(ISBLANK(Circuits!C15),\"\",Circuits!C15)","v":""},"","",{"$f":"IF(ISNA(VLOOKUP($K20,'E1'!$B$3:$G$22,5,FALSE)),\"\",VLOOKUP($K20,'E1'!$B$3:$G$22,5,FALSE))","v":""},{"$f":"IF(ISNA((VLOOKUP($K20,'E1'!$B$3:$G$22,6,FALSE))),\"\",IF(ISBLANK(VLOOKUP($K20,'E1'!$B$3:$G$22,6,FALSE)),\"\",VLOOKUP($K20,'E1'!$B$3:$G$22,6,FALSE)))","v":""},{"$f":"IF(ISNA(VLOOKUP($K20,'E2'!$B$3:$G$22,5,FALSE)),\"\",VLOOKUP($K20,'E2'!$B$3:$G$22,5,FALSE))","v":""},{"$f":"IF(ISNA((VLOOKUP($K20,'E2'!$B$3:$G$22,6,FALSE))),\"\",IF(ISBLANK(VLOOKUP($K20,'E2'!$B$3:$G$22,6,FALSE)),\"\",VLOOKUP($K20,'E2'!$B$3:$G$22,6,FALSE)))","v":""},{"$f":"IF(ISNA(VLOOKUP($K20,'E3'!$B$3:$G$22,5,FALSE)),\"\",VLOOKUP($K20,'E3'!$B$3:$G$22,5,FALSE))","v":""},{"$f":"IF(ISNA((VLOOKUP($K20,'E3'!$B$3:$G$22,6,FALSE))),\"\",IF(ISBLANK(VLOOKUP($K20,'E3'!$B$3:$G$22,6,FALSE)),\"\",VLOOKUP($K20,'E3'!$B$3:$G$22,6,FALSE)))","v":""},{"$f":"IF(ISNA(VLOOKUP($K20,'E4'!$B$3:$G$22,5,FALSE)),\"\",VLOOKUP($K20,'E4'!$B$3:$G$22,5,FALSE))","v":""},{"$f":"IF(ISNA((VLOOKUP($K20,'E4'!$B$3:$G$22,6,FALSE))),\"\",IF(ISBLANK(VLOOKUP($K20,'E4'!$B$3:$G$22,6,FALSE)),\"\",VLOOKUP($K20,'E4'!$B$3:$G$22,6,FALSE)))","v":""},{"$f":"IF(ISNA(VLOOKUP($K20,'E5'!$B$3:$G$22,5,FALSE)),\"\",VLOOKUP($K20,'E5'!$B$3:$G$22,5,FALSE))","v":""},{"$f":"IF(ISNA((VLOOKUP($K20,'E5'!$B$3:$G$22,6,FALSE))),\"\",IF(ISBLANK(VLOOKUP($K20,'E5'!$B$3:$G$22,6,FALSE)),\"\",VLOOKUP($K20,'E5'!$B$3:$G$22,6,FALSE)))","v":""},{"$f":"IF(ISNA(VLOOKUP($K20,'E6'!$B$3:$G$22,5,FALSE)),\"\",VLOOKUP($K20,'E6'!$B$3:$G$22,5,FALSE))","v":""},{"$f":"IF(ISNA((VLOOKUP($K20,'E6'!$B$3:$G$22,6,FALSE))),\"\",IF(ISBLANK(VLOOKUP($K20,'E6'!$B$3:$G$22,6,FALSE)),\"\",VLOOKUP($K20,'E6'!$B$3:$G$22,6,FALSE)))","v":""},{"$f":"IF(ISNA(VLOOKUP($K20,'E7'!$B$3:$G$22,5,FALSE)),\"\",VLOOKUP($K20,'E7'!$B$3:$G$22,5,FALSE))","v":""},{"$f":"IF(ISNA((VLOOKUP($K20,'E7'!$B$3:$G$22,6,FALSE))),\"\",IF(ISBLANK(VLOOKUP($K20,'E7'!$B$3:$G$22,6,FALSE)),\"\",VLOOKUP($K20,'E7'!$B$3:$G$22,6,FALSE)))","v":""},{"$f":"IF(ISNA(VLOOKUP($K20,'E8'!$B$3:$G$22,5,FALSE)),\"\",VLOOKUP($K20,'E8'!$B$3:$G$22,5,FALSE))","v":""},{"$f":"IF(ISNA((VLOOKUP($K20,'E8'!$B$3:$G$22,6,FALSE))),\"\",IF(ISBLANK(VLOOKUP($K20,'E8'!$B$3:$G$22,6,FALSE)),\"\",VLOOKUP($K20,'E8'!$B$3:$G$22,6,FALSE)))","v":""},{"$f":"IF(ISNA(VLOOKUP($K20,'E9'!$B$3:$G$22,5,FALSE)),\"\",VLOOKUP($K20,'E9'!$B$3:$G$22,5,FALSE))","v":""},{"$f":"IF(ISNA((VLOOKUP($K20,'E9'!$B$3:$G$22,6,FALSE))),\"\",IF(ISBLANK(VLOOKUP($K20,'E9'!$B$3:$G$22,6,FALSE)),\"\",VLOOKUP($K20,'E9'!$B$3:$G$22,6,FALSE)))","v":""},{"$f":"IF(ISNA(VLOOKUP($K20,'E10'!$B$3:$G$22,5,FALSE)),\"\",VLOOKUP($K20,'E10'!$B$3:$G$22,5,FALSE))","v":""},{"$f":"IF(ISNA((VLOOKUP($K20,'E10'!$B$3:$G$22,6,FALSE))),\"\",IF(ISBLANK(VLOOKUP($K20,'E10'!$B$3:$G$22,6,FALSE)),\"\",VLOOKUP($K20,'E10'!$B$3:$G$22,6,FALSE)))","v":""},{"$f":"IF(ISNA(VLOOKUP($K20,'E11'!$B$3:$G$22,5,FALSE)),\"\",VLOOKUP($K20,'E11'!$B$3:$G$22,5,FALSE))","v":""},{"$f":"IF(ISNA((VLOOKUP($K20,'E11'!$B$3:$G$22,6,FALSE))),\"\",IF(ISBLANK(VLOOKUP($K20,'E11'!$B$3:$G$22,6,FALSE)),\"\",VLOOKUP($K20,'E11'!$B$3:$G$22,6,FALSE)))","v":""},{"$f":"IF(ISNA(VLOOKUP($K20,'E12'!$B$3:$G$22,5,FALSE)),\"\",VLOOKUP($K20,'E12'!$B$3:$G$22,5,FALSE))","v":""},{"$f":"IF(ISNA((VLOOKUP($K20,'E12'!$B$3:$G$22,6,FALSE))),\"\",IF(ISBLANK(VLOOKUP($K20,'E12'!$B$3:$G$22,6,FALSE)),\"\",VLOOKUP($K20,'E12'!$B$3:$G$22,6,FALSE)))","v":""},{"$f":"IF(ISNA(VLOOKUP($K20,'E13'!$B$3:$G$22,5,FALSE)),\"\",VLOOKUP($K20,'E13'!$B$3:$G$22,5,FALSE))","v":""},{"$f":"IF(ISNA((VLOOKUP($K20,'E13'!$B$3:$G$22,6,FALSE))),\"\",IF(ISBLANK(VLOOKUP($K20,'E13'!$B$3:$G$22,6,FALSE)),\"\",VLOOKUP($K20,'E13'!$B$3:$G$22,6,FALSE)))","v":""},{"$f":"IF(ISNA(VLOOKUP($K20,'E14'!$B$3:$G$22,5,FALSE)),\"\",VLOOKUP($K20,'E14'!$B$3:$G$22,5,FALSE))","v":""},{"$f":"IF(ISNA((VLOOKUP($K20,'E14'!$B$3:$G$22,6,FALSE))),\"\",IF(ISBLANK(VLOOKUP($K20,'E14'!$B$3:$G$22,6,FALSE)),\"\",VLOOKUP($K20,'E14'!$B$3:$G$22,6,FALSE)))","v":""},{"$f":"IF(ISNA(VLOOKUP($K20,'E15'!$B$3:$G$22,5,FALSE)),\"\",VLOOKUP($K20,'E15'!$B$3:$G$22,5,FALSE))","v":""},{"$f":"IF(ISNA((VLOOKUP($K20,'E15'!$B$3:$G$22,6,FALSE))),\"\",IF(VLOOKUP($K20,'E15'!$B$3:$G$22,6,FALSE)=0,\"\",VLOOKUP($K20,'E15'!$B$3:$G$22,6,FALSE)))","v":""},{"$f":"IF(ISNA(VLOOKUP($K20,'E16'!$B$3:$G$22,5,FALSE)),\"\",VLOOKUP($K20,'E16'!$B$3:$G$22,5,FALSE))","v":""},{"$f":"IF(ISNA((VLOOKUP($K20,'E16'!$B$3:$G$22,6,FALSE))),\"\",IF(ISBLANK(VLOOKUP($K20,'E16'!$B$3:$G$22,6,FALSE)),\"\",VLOOKUP($K20,'E16'!$B$3:$G$22,6,FALSE)))","v":""},{"$f":"IF(ISNA(VLOOKUP($K20,'E17'!$B$3:$G$22,5,FALSE)),\"\",VLOOKUP($K20,'E17'!$B$3:$G$22,5,FALSE))","v":""},{"$f":"IF(ISNA((VLOOKUP($K20,'E17'!$B$3:$G$22,6,FALSE))),\"\",IF(ISBLANK(VLOOKUP($K20,'E17'!$B$3:$G$22,6,FALSE)),\"\",VLOOKUP($K20,'E17'!$B$3:$G$22,6,FALSE)))","v":""},{"$f":"IF(ISNA(VLOOKUP($K20,'E18'!$B$3:$G$22,5,FALSE)),\"\",VLOOKUP($K20,'E18'!$B$3:$G$22,5,FALSE))","v":""},{"$f":"IF(ISNA((VLOOKUP($K20,'E18'!$B$3:$G$22,6,FALSE))),\"\",IF(ISBLANK(VLOOKUP($K20,'E18'!$B$3:$G$22,6,FALSE)),\"\",VLOOKUP($K20,'E18'!$B$3:$G$22,6,FALSE)))","v":""},{"$f":"IF(ISNA(VLOOKUP($K20,'E19'!$B$3:$G$22,5,FALSE)),\"\",VLOOKUP($K20,'E19'!$B$3:$G$22,5,FALSE))","v":""},{"$f":"IF(ISNA((VLOOKUP($K20,'E19'!$B$3:$G$22,6,FALSE))),\"\",IF(ISBLANK(VLOOKUP($K20,'E19'!$B$3:$G$22,6,FALSE)),\"\",VLOOKUP($K20,'E19'!$B$3:$G$22,6,FALSE)))","v":""},{"$f":"IF(ISNA(VLOOKUP($K20,'E20'!$B$3:$G$22,5,FALSE)),\"\",VLOOKUP($K20,'E20'!$B$3:$G$22,5,FALSE))","v":""},{"$f":"IF(ISNA((VLOOKUP($K20,'E20'!$B$3:$G$22,6,FALSE))),\"\",IF(ISBLANK(VLOOKUP($K20,'E20'!$B$3:$G$22,6,FALSE)),\"\",VLOOKUP($K20,'E20'!$B$3:$G$22,6,FALSE)))","v":""},{"$f":"IF(ISNA(VLOOKUP($K20,'E21'!$B$3:$G$22,5,FALSE)),\"\",VLOOKUP($K20,'E21'!$B$3:$G$22,5,FALSE))","v":""},{"$f":"IF(ISNA((VLOOKUP($K20,'E21'!$B$3:$G$22,6,FALSE))),\"\",IF(ISBLANK(VLOOKUP($K20,'E21'!$B$3:$G$22,6,FALSE)),\"\",VLOOKUP($K20,'E21'!$B$3:$G$22,6,FALSE)))","v":""},{"$f":"IF(ISNA(VLOOKUP($K20,'E22'!$B$3:$G$22,5,FALSE)),\"\",VLOOKUP($K20,'E22'!$B$3:$G$22,5,FALSE))","v":""},{"$f":"IF(ISNA((VLOOKUP($K20,'E22'!$B$3:$G$22,6,FALSE))),\"\",IF(ISBLANK(VLOOKUP($K20,'E22'!$B$3:$G$22,6,FALSE)),\"\",VLOOKUP($K20,'E22'!$B$3:$G$22,6,FALSE)))","v":""},{"$f":"IF(ISNA(VLOOKUP($K20,'E23'!$B$3:$G$22,5,FALSE)),\"\",VLOOKUP($K20,'E23'!$B$3:$G$22,5,FALSE))","v":""},{"$f":"IF(ISNA((VLOOKUP($K20,'E23'!$B$3:$G$22,6,FALSE))),\"\",IF(ISBLANK(VLOOKUP($K20,'E23'!$B$3:$G$22,6,FALSE)),\"\",VLOOKUP($K20,'E23'!$B$3:$G$22,6,FALSE)))","v":""},{"$f":"IF(ISNA(VLOOKUP($K20,'E24'!$B$3:$G$22,5,FALSE)),\"\",VLOOKUP($K20,'E24'!$B$3:$G$22,5,FALSE))","v":""},{"$f":"IF(ISNA((VLOOKUP($K20,'E24'!$B$3:$G$22,6,FALSE))),\"\",IF(ISBLANK(VLOOKUP($K20,'E24'!$B$3:$G$22,6,FALSE)),\"\",VLOOKUP($K20,'E24'!$B$3:$G$22,6,FALSE)))","v":""},{"$f":"IF(ISNA(VLOOKUP($K20,'E25'!$B$3:$G$22,5,FALSE)),\"\",VLOOKUP($K20,'E25'!$B$3:$G$22,5,FALSE))","v":""},{"$f":"IF(ISNA((VLOOKUP($K20,'E25'!$B$3:$G$22,6,FALSE))),\"\",IF(ISBLANK(VLOOKUP($K20,'E25'!$B$3:$G$22,6,FALSE)),\"\",VLOOKUP($K20,'E25'!$B$3:$G$22,6,FALSE)))","v":""},{"$f":"IF(ISNA(VLOOKUP($K20,'E26'!$B$3:$G$22,5,FALSE)),\"\",VLOOKUP($K20,'E26'!$B$3:$G$22,5,FALSE))","v":""},{"$f":"IF(ISNA((VLOOKUP($K20,'E26'!$B$3:$G$22,6,FALSE))),\"\",IF(ISBLANK(VLOOKUP($K20,'E26'!$B$3:$G$22,6,FALSE)),\"\",VLOOKUP($K20,'E26'!$B$3:$G$22,6,FALSE)))","v":""},{"$f":"IF(ISNA(VLOOKUP($K20,'E27'!$B$3:$G$22,5,FALSE)),\"\",VLOOKUP($K20,'E27'!$B$3:$G$22,5,FALSE))","v":""},{"$f":"IF(ISNA((VLOOKUP($K20,'E27'!$B$3:$G$22,6,FALSE))),\"\",IF(ISBLANK(VLOOKUP($K20,'E27'!$B$3:$G$22,6,FALSE)),\"\",VLOOKUP($K20,'E27'!$B$3:$G$22,6,FALSE)))","v":""},{"$f":"IF(ISNA(VLOOKUP($K20,'E28'!$B$3:$G$22,5,FALSE)),\"\",VLOOKUP($K20,'E28'!$B$3:$G$22,5,FALSE))","v":""},{"$f":"IF(ISNA((VLOOKUP($K20,'E28'!$B$3:$G$22,6,FALSE))),\"\",IF(ISBLANK(VLOOKUP($K20,'E28'!$B$3:$G$22,6,FALSE)),\"\",VLOOKUP($K20,'E28'!$B$3:$G$22,6,FALSE)))","v":""},{"$f":"IF(ISNA(VLOOKUP($K20,'E29'!$B$3:$G$22,5,FALSE)),\"\",VLOOKUP($K20,'E29'!$B$3:$G$22,5,FALSE))","v":""},{"$f":"IF(ISNA((VLOOKUP($K20,'E29'!$B$3:$G$22,6,FALSE))),\"\",IF(ISBLANK(VLOOKUP($K20,'E29'!$B$3:$G$22,6,FALSE)),\"\",VLOOKUP($K20,'E29'!$B$3:$G$22,6,FALSE)))","v":""},{"$f":"IF(ISNA(VLOOKUP($K20,'E30'!$B$3:$G$22,5,FALSE)),\"\",VLOOKUP($K20,'E30'!$B$3:$G$22,5,FALSE))","v":""},{"$f":"IF(ISNA((VLOOKUP($K20,'E30'!$B$3:$G$22,6,FALSE))),\"\",IF(ISBLANK(VLOOKUP($K20,'E30'!$B$3:$G$22,6,FALSE)),\"\",VLOOKUP($K20,'E30'!$B$3:$G$22,6,FALSE)))","v":""}]
["E17",{"$f":"CONCATENATE('Liste classe'!E19,\" \",'Liste classe'!F19,\" \",'Liste classe'!G19,\" \",'Liste classe'!H19,\" \",'Liste classe'!I19,\" \",'Liste classe'!J19)","v":"     "},{"$f":"'E17'!$F$24","v":"00:00:00"},{"$f":"'E17'!$F$26","v":" "},{"$f":"'E17'!$G$28","v":0},{"$f":"'E17'!$I$28","v":0},{"$f":"COUNTA('E17'!$D$3:$D$22)","v":0},null,null,null,{"$f":"IF(ISBLANK(Circuits!B16),\"\",Circuits!B16)","v":""},{"$f":"IF(ISBLANK(Circuits!C16),\"\",Circuits!C16)","v":""},"","",{"$f":"IF(ISNA(VLOOKUP($K21,'E1'!$B$3:$G$22,5,FALSE)),\"\",VLOOKUP($K21,'E1'!$B$3:$G$22,5,FALSE))","v":""},{"$f":"IF(ISNA((VLOOKUP($K21,'E1'!$B$3:$G$22,6,FALSE))),\"\",IF(ISBLANK(VLOOKUP($K21,'E1'!$B$3:$G$22,6,FALSE)),\"\",VLOOKUP($K21,'E1'!$B$3:$G$22,6,FALSE)))","v":""},{"$f":"IF(ISNA(VLOOKUP($K21,'E2'!$B$3:$G$22,5,FALSE)),\"\",VLOOKUP($K21,'E2'!$B$3:$G$22,5,FALSE))","v":""},{"$f":"IF(ISNA((VLOOKUP($K21,'E2'!$B$3:$G$22,6,FALSE))),\"\",IF(ISBLANK(VLOOKUP($K21,'E2'!$B$3:$G$22,6,FALSE)),\"\",VLOOKUP($K21,'E2'!$B$3:$G$22,6,FALSE)))","v":""},{"$f":"IF(ISNA(VLOOKUP($K21,'E3'!$B$3:$G$22,5,FALSE)),\"\",VLOOKUP($K21,'E3'!$B$3:$G$22,5,FALSE))","v":""},{"$f":"IF(ISNA((VLOOKUP($K21,'E3'!$B$3:$G$22,6,FALSE))),\"\",IF(ISBLANK(VLOOKUP($K21,'E3'!$B$3:$G$22,6,FALSE)),\"\",VLOOKUP($K21,'E3'!$B$3:$G$22,6,FALSE)))","v":""},{"$f":"IF(ISNA(VLOOKUP($K21,'E4'!$B$3:$G$22,5,FALSE)),\"\",VLOOKUP($K21,'E4'!$B$3:$G$22,5,FALSE))","v":""},{"$f":"IF(ISNA((VLOOKUP($K21,'E4'!$B$3:$G$22,6,FALSE))),\"\",IF(ISBLANK(VLOOKUP($K21,'E4'!$B$3:$G$22,6,FALSE)),\"\",VLOOKUP($K21,'E4'!$B$3:$G$22,6,FALSE)))","v":""},{"$f":"IF(ISNA(VLOOKUP($K21,'E5'!$B$3:$G$22,5,FALSE)),\"\",VLOOKUP($K21,'E5'!$B$3:$G$22,5,FALSE))","v":""},{"$f":"IF(ISNA((VLOOKUP($K21,'E5'!$B$3:$G$22,6,FALSE))),\"\",IF(ISBLANK(VLOOKUP($K21,'E5'!$B$3:$G$22,6,FALSE)),\"\",VLOOKUP($K21,'E5'!$B$3:$G$22,6,FALSE)))","v":""},{"$f":"IF(ISNA(VLOOKUP($K21,'E6'!$B$3:$G$22,5,FALSE)),\"\",VLOOKUP($K21,'E6'!$B$3:$G$22,5,FALSE))","v":""},{"$f":"IF(ISNA((VLOOKUP($K21,'E6'!$B$3:$G$22,6,FALSE))),\"\",IF(ISBLANK(VLOOKUP($K21,'E6'!$B$3:$G$22,6,FALSE)),\"\",VLOOKUP($K21,'E6'!$B$3:$G$22,6,FALSE)))","v":""},{"$f":"IF(ISNA(VLOOKUP($K21,'E7'!$B$3:$G$22,5,FALSE)),\"\",VLOOKUP($K21,'E7'!$B$3:$G$22,5,FALSE))","v":""},{"$f":"IF(ISNA((VLOOKUP($K21,'E7'!$B$3:$G$22,6,FALSE))),\"\",IF(ISBLANK(VLOOKUP($K21,'E7'!$B$3:$G$22,6,FALSE)),\"\",VLOOKUP($K21,'E7'!$B$3:$G$22,6,FALSE)))","v":""},{"$f":"IF(ISNA(VLOOKUP($K21,'E8'!$B$3:$G$22,5,FALSE)),\"\",VLOOKUP($K21,'E8'!$B$3:$G$22,5,FALSE))","v":""},{"$f":"IF(ISNA((VLOOKUP($K21,'E8'!$B$3:$G$22,6,FALSE))),\"\",IF(ISBLANK(VLOOKUP($K21,'E8'!$B$3:$G$22,6,FALSE)),\"\",VLOOKUP($K21,'E8'!$B$3:$G$22,6,FALSE)))","v":""},{"$f":"IF(ISNA(VLOOKUP($K21,'E9'!$B$3:$G$22,5,FALSE)),\"\",VLOOKUP($K21,'E9'!$B$3:$G$22,5,FALSE))","v":""},{"$f":"IF(ISNA((VLOOKUP($K21,'E9'!$B$3:$G$22,6,FALSE))),\"\",IF(ISBLANK(VLOOKUP($K21,'E9'!$B$3:$G$22,6,FALSE)),\"\",VLOOKUP($K21,'E9'!$B$3:$G$22,6,FALSE)))","v":""},{"$f":"IF(ISNA(VLOOKUP($K21,'E10'!$B$3:$G$22,5,FALSE)),\"\",VLOOKUP($K21,'E10'!$B$3:$G$22,5,FALSE))","v":""},{"$f":"IF(ISNA((VLOOKUP($K21,'E10'!$B$3:$G$22,6,FALSE))),\"\",IF(ISBLANK(VLOOKUP($K21,'E10'!$B$3:$G$22,6,FALSE)),\"\",VLOOKUP($K21,'E10'!$B$3:$G$22,6,FALSE)))","v":""},{"$f":"IF(ISNA(VLOOKUP($K21,'E11'!$B$3:$G$22,5,FALSE)),\"\",VLOOKUP($K21,'E11'!$B$3:$G$22,5,FALSE))","v":""},{"$f":"IF(ISNA((VLOOKUP($K21,'E11'!$B$3:$G$22,6,FALSE))),\"\",IF(ISBLANK(VLOOKUP($K21,'E11'!$B$3:$G$22,6,FALSE)),\"\",VLOOKUP($K21,'E11'!$B$3:$G$22,6,FALSE)))","v":""},{"$f":"IF(ISNA(VLOOKUP($K21,'E12'!$B$3:$G$22,5,FALSE)),\"\",VLOOKUP($K21,'E12'!$B$3:$G$22,5,FALSE))","v":""},{"$f":"IF(ISNA((VLOOKUP($K21,'E12'!$B$3:$G$22,6,FALSE))),\"\",IF(ISBLANK(VLOOKUP($K21,'E12'!$B$3:$G$22,6,FALSE)),\"\",VLOOKUP($K21,'E12'!$B$3:$G$22,6,FALSE)))","v":""},{"$f":"IF(ISNA(VLOOKUP($K21,'E13'!$B$3:$G$22,5,FALSE)),\"\",VLOOKUP($K21,'E13'!$B$3:$G$22,5,FALSE))","v":""},{"$f":"IF(ISNA((VLOOKUP($K21,'E13'!$B$3:$G$22,6,FALSE))),\"\",IF(ISBLANK(VLOOKUP($K21,'E13'!$B$3:$G$22,6,FALSE)),\"\",VLOOKUP($K21,'E13'!$B$3:$G$22,6,FALSE)))","v":""},{"$f":"IF(ISNA(VLOOKUP($K21,'E14'!$B$3:$G$22,5,FALSE)),\"\",VLOOKUP($K21,'E14'!$B$3:$G$22,5,FALSE))","v":""},{"$f":"IF(ISNA((VLOOKUP($K21,'E14'!$B$3:$G$22,6,FALSE))),\"\",IF(ISBLANK(VLOOKUP($K21,'E14'!$B$3:$G$22,6,FALSE)),\"\",VLOOKUP($K21,'E14'!$B$3:$G$22,6,FALSE)))","v":""},{"$f":"IF(ISNA(VLOOKUP($K21,'E15'!$B$3:$G$22,5,FALSE)),\"\",VLOOKUP($K21,'E15'!$B$3:$G$22,5,FALSE))","v":""},{"$f":"IF(ISNA((VLOOKUP($K21,'E15'!$B$3:$G$22,6,FALSE))),\"\",IF(VLOOKUP($K21,'E15'!$B$3:$G$22,6,FALSE)=0,\"\",VLOOKUP($K21,'E15'!$B$3:$G$22,6,FALSE)))","v":""},{"$f":"IF(ISNA(VLOOKUP($K21,'E16'!$B$3:$G$22,5,FALSE)),\"\",VLOOKUP($K21,'E16'!$B$3:$G$22,5,FALSE))","v":""},{"$f":"IF(ISNA((VLOOKUP($K21,'E16'!$B$3:$G$22,6,FALSE))),\"\",IF(ISBLANK(VLOOKUP($K21,'E16'!$B$3:$G$22,6,FALSE)),\"\",VLOOKUP($K21,'E16'!$B$3:$G$22,6,FALSE)))","v":""},{"$f":"IF(ISNA(VLOOKUP($K21,'E17'!$B$3:$G$22,5,FALSE)),\"\",VLOOKUP($K21,'E17'!$B$3:$G$22,5,FALSE))","v":""},{"$f":"IF(ISNA((VLOOKUP($K21,'E17'!$B$3:$G$22,6,FALSE))),\"\",IF(ISBLANK(VLOOKUP($K21,'E17'!$B$3:$G$22,6,FALSE)),\"\",VLOOKUP($K21,'E17'!$B$3:$G$22,6,FALSE)))","v":""},{"$f":"IF(ISNA(VLOOKUP($K21,'E18'!$B$3:$G$22,5,FALSE)),\"\",VLOOKUP($K21,'E18'!$B$3:$G$22,5,FALSE))","v":""},{"$f":"IF(ISNA((VLOOKUP($K21,'E18'!$B$3:$G$22,6,FALSE))),\"\",IF(ISBLANK(VLOOKUP($K21,'E18'!$B$3:$G$22,6,FALSE)),\"\",VLOOKUP($K21,'E18'!$B$3:$G$22,6,FALSE)))","v":""},{"$f":"IF(ISNA(VLOOKUP($K21,'E19'!$B$3:$G$22,5,FALSE)),\"\",VLOOKUP($K21,'E19'!$B$3:$G$22,5,FALSE))","v":""},{"$f":"IF(ISNA((VLOOKUP($K21,'E19'!$B$3:$G$22,6,FALSE))),\"\",IF(ISBLANK(VLOOKUP($K21,'E19'!$B$3:$G$22,6,FALSE)),\"\",VLOOKUP($K21,'E19'!$B$3:$G$22,6,FALSE)))","v":""},{"$f":"IF(ISNA(VLOOKUP($K21,'E20'!$B$3:$G$22,5,FALSE)),\"\",VLOOKUP($K21,'E20'!$B$3:$G$22,5,FALSE))","v":""},{"$f":"IF(ISNA((VLOOKUP($K21,'E20'!$B$3:$G$22,6,FALSE))),\"\",IF(ISBLANK(VLOOKUP($K21,'E20'!$B$3:$G$22,6,FALSE)),\"\",VLOOKUP($K21,'E20'!$B$3:$G$22,6,FALSE)))","v":""},{"$f":"IF(ISNA(VLOOKUP($K21,'E21'!$B$3:$G$22,5,FALSE)),\"\",VLOOKUP($K21,'E21'!$B$3:$G$22,5,FALSE))","v":""},{"$f":"IF(ISNA((VLOOKUP($K21,'E21'!$B$3:$G$22,6,FALSE))),\"\",IF(ISBLANK(VLOOKUP($K21,'E21'!$B$3:$G$22,6,FALSE)),\"\",VLOOKUP($K21,'E21'!$B$3:$G$22,6,FALSE)))","v":""},{"$f":"IF(ISNA(VLOOKUP($K21,'E22'!$B$3:$G$22,5,FALSE)),\"\",VLOOKUP($K21,'E22'!$B$3:$G$22,5,FALSE))","v":""},{"$f":"IF(ISNA((VLOOKUP($K21,'E22'!$B$3:$G$22,6,FALSE))),\"\",IF(ISBLANK(VLOOKUP($K21,'E22'!$B$3:$G$22,6,FALSE)),\"\",VLOOKUP($K21,'E22'!$B$3:$G$22,6,FALSE)))","v":""},{"$f":"IF(ISNA(VLOOKUP($K21,'E23'!$B$3:$G$22,5,FALSE)),\"\",VLOOKUP($K21,'E23'!$B$3:$G$22,5,FALSE))","v":""},{"$f":"IF(ISNA((VLOOKUP($K21,'E23'!$B$3:$G$22,6,FALSE))),\"\",IF(ISBLANK(VLOOKUP($K21,'E23'!$B$3:$G$22,6,FALSE)),\"\",VLOOKUP($K21,'E23'!$B$3:$G$22,6,FALSE)))","v":""},{"$f":"IF(ISNA(VLOOKUP($K21,'E24'!$B$3:$G$22,5,FALSE)),\"\",VLOOKUP($K21,'E24'!$B$3:$G$22,5,FALSE))","v":""},{"$f":"IF(ISNA((VLOOKUP($K21,'E24'!$B$3:$G$22,6,FALSE))),\"\",IF(ISBLANK(VLOOKUP($K21,'E24'!$B$3:$G$22,6,FALSE)),\"\",VLOOKUP($K21,'E24'!$B$3:$G$22,6,FALSE)))","v":""},{"$f":"IF(ISNA(VLOOKUP($K21,'E25'!$B$3:$G$22,5,FALSE)),\"\",VLOOKUP($K21,'E25'!$B$3:$G$22,5,FALSE))","v":""},{"$f":"IF(ISNA((VLOOKUP($K21,'E25'!$B$3:$G$22,6,FALSE))),\"\",IF(ISBLANK(VLOOKUP($K21,'E25'!$B$3:$G$22,6,FALSE)),\"\",VLOOKUP($K21,'E25'!$B$3:$G$22,6,FALSE)))","v":""},{"$f":"IF(ISNA(VLOOKUP($K21,'E26'!$B$3:$G$22,5,FALSE)),\"\",VLOOKUP($K21,'E26'!$B$3:$G$22,5,FALSE))","v":""},{"$f":"IF(ISNA((VLOOKUP($K21,'E26'!$B$3:$G$22,6,FALSE))),\"\",IF(ISBLANK(VLOOKUP($K21,'E26'!$B$3:$G$22,6,FALSE)),\"\",VLOOKUP($K21,'E26'!$B$3:$G$22,6,FALSE)))","v":""},{"$f":"IF(ISNA(VLOOKUP($K21,'E27'!$B$3:$G$22,5,FALSE)),\"\",VLOOKUP($K21,'E27'!$B$3:$G$22,5,FALSE))","v":""},{"$f":"IF(ISNA((VLOOKUP($K21,'E27'!$B$3:$G$22,6,FALSE))),\"\",IF(ISBLANK(VLOOKUP($K21,'E27'!$B$3:$G$22,6,FALSE)),\"\",VLOOKUP($K21,'E27'!$B$3:$G$22,6,FALSE)))","v":""},{"$f":"IF(ISNA(VLOOKUP($K21,'E28'!$B$3:$G$22,5,FALSE)),\"\",VLOOKUP($K21,'E28'!$B$3:$G$22,5,FALSE))","v":""},{"$f":"IF(ISNA((VLOOKUP($K21,'E28'!$B$3:$G$22,6,FALSE))),\"\",IF(ISBLANK(VLOOKUP($K21,'E28'!$B$3:$G$22,6,FALSE)),\"\",VLOOKUP($K21,'E28'!$B$3:$G$22,6,FALSE)))","v":""},{"$f":"IF(ISNA(VLOOKUP($K21,'E29'!$B$3:$G$22,5,FALSE)),\"\",VLOOKUP($K21,'E29'!$B$3:$G$22,5,FALSE))","v":""},{"$f":"IF(ISNA((VLOOKUP($K21,'E29'!$B$3:$G$22,6,FALSE))),\"\",IF(ISBLANK(VLOOKUP($K21,'E29'!$B$3:$G$22,6,FALSE)),\"\",VLOOKUP($K21,'E29'!$B$3:$G$22,6,FALSE)))","v":""},{"$f":"IF(ISNA(VLOOKUP($K21,'E30'!$B$3:$G$22,5,FALSE)),\"\",VLOOKUP($K21,'E30'!$B$3:$G$22,5,FALSE))","v":""},{"$f":"IF(ISNA((VLOOKUP($K21,'E30'!$B$3:$G$22,6,FALSE))),\"\",IF(ISBLANK(VLOOKUP($K21,'E30'!$B$3:$G$22,6,FALSE)),\"\",VLOOKUP($K21,'E30'!$B$3:$G$22,6,FALSE)))","v":""}]
["E18",{"$f":"CONCATENATE('Liste classe'!E20,\" \",'Liste classe'!F20,\" \",'Liste classe'!G20,\" \",'Liste classe'!H20,\" \",'Liste classe'!I20,\" \",'Liste classe'!J20)","v":"     "},{"$f":"'E18'!$F$24","v":"00:00:00"},{"$f":"'E18'!$F$26","v":" "},{"$f":"'E18'!$G$28","v":0},{"$f":"'E18'!$I$28","v":0},{"$f":"COUNTA('E18'!$D$3:$D$22)","v":0},null,null,null,{"$f":"IF(ISBLANK(Circuits!B17),\"\",Circuits!B17)","v":""},{"$f":"IF(ISBLANK(Circuits!C17),\"\",Circuits!C17)","v":""},"","",{"$f":"IF(ISNA(VLOOKUP($K22,'E1'!$B$3:$G$22,5,FALSE)),\"\",VLOOKUP($K22,'E1'!$B$3:$G$22,5,FALSE))","v":""},{"$f":"IF(ISNA((VLOOKUP($K22,'E1'!$B$3:$G$22,6,FALSE))),\"\",IF(ISBLANK(VLOOKUP($K22,'E1'!$B$3:$G$22,6,FALSE)),\"\",VLOOKUP($K22,'E1'!$B$3:$G$22,6,FALSE)))","v":""},{"$f":"IF(ISNA(VLOOKUP($K22,'E2'!$B$3:$G$22,5,FALSE)),\"\",VLOOKUP($K22,'E2'!$B$3:$G$22,5,FALSE))","v":""},{"$f":"IF(ISNA((VLOOKUP($K22,'E2'!$B$3:$G$22,6,FALSE))),\"\",IF(ISBLANK(VLOOKUP($K22,'E2'!$B$3:$G$22,6,FALSE)),\"\",VLOOKUP($K22,'E2'!$B$3:$G$22,6,FALSE)))","v":""},{"$f":"IF(ISNA(VLOOKUP($K22,'E3'!$B$3:$G$22,5,FALSE)),\"\",VLOOKUP($K22,'E3'!$B$3:$G$22,5,FALSE))","v":""},{"$f":"IF(ISNA((VLOOKUP($K22,'E3'!$B$3:$G$22,6,FALSE))),\"\",IF(ISBLANK(VLOOKUP($K22,'E3'!$B$3:$G$22,6,FALSE)),\"\",VLOOKUP($K22,'E3'!$B$3:$G$22,6,FALSE)))","v":""},{"$f":"IF(ISNA(VLOOKUP($K22,'E4'!$B$3:$G$22,5,FALSE)),\"\",VLOOKUP($K22,'E4'!$B$3:$G$22,5,FALSE))","v":""},{"$f":"IF(ISNA((VLOOKUP($K22,'E4'!$B$3:$G$22,6,FALSE))),\"\",IF(ISBLANK(VLOOKUP($K22,'E4'!$B$3:$G$22,6,FALSE)),\"\",VLOOKUP($K22,'E4'!$B$3:$G$22,6,FALSE)))","v":""},{"$f":"IF(ISNA(VLOOKUP($K22,'E5'!$B$3:$G$22,5,FALSE)),\"\",VLOOKUP($K22,'E5'!$B$3:$G$22,5,FALSE))","v":""},{"$f":"IF(ISNA((VLOOKUP($K22,'E5'!$B$3:$G$22,6,FALSE))),\"\",IF(ISBLANK(VLOOKUP($K22,'E5'!$B$3:$G$22,6,FALSE)),\"\",VLOOKUP($K22,'E5'!$B$3:$G$22,6,FALSE)))","v":""},{"$f":"IF(ISNA(VLOOKUP($K22,'E6'!$B$3:$G$22,5,FALSE)),\"\",VLOOKUP($K22,'E6'!$B$3:$G$22,5,FALSE))","v":""},{"$f":"IF(ISNA((VLOOKUP($K22,'E6'!$B$3:$G$22,6,FALSE))),\"\",IF(ISBLANK(VLOOKUP($K22,'E6'!$B$3:$G$22,6,FALSE)),\"\",VLOOKUP($K22,'E6'!$B$3:$G$22,6,FALSE)))","v":""},{"$f":"IF(ISNA(VLOOKUP($K22,'E7'!$B$3:$G$22,5,FALSE)),\"\",VLOOKUP($K22,'E7'!$B$3:$G$22,5,FALSE))","v":""},{"$f":"IF(ISNA((VLOOKUP($K22,'E7'!$B$3:$G$22,6,FALSE))),\"\",IF(ISBLANK(VLOOKUP($K22,'E7'!$B$3:$G$22,6,FALSE)),\"\",VLOOKUP($K22,'E7'!$B$3:$G$22,6,FALSE)))","v":""},{"$f":"IF(ISNA(VLOOKUP($K22,'E8'!$B$3:$G$22,5,FALSE)),\"\",VLOOKUP($K22,'E8'!$B$3:$G$22,5,FALSE))","v":""},{"$f":"IF(ISNA((VLOOKUP($K22,'E8'!$B$3:$G$22,6,FALSE))),\"\",IF(ISBLANK(VLOOKUP($K22,'E8'!$B$3:$G$22,6,FALSE)),\"\",VLOOKUP($K22,'E8'!$B$3:$G$22,6,FALSE)))","v":""},{"$f":"IF(ISNA(VLOOKUP($K22,'E9'!$B$3:$G$22,5,FALSE)),\"\",VLOOKUP($K22,'E9'!$B$3:$G$22,5,FALSE))","v":""},{"$f":"IF(ISNA((VLOOKUP($K22,'E9'!$B$3:$G$22,6,FALSE))),\"\",IF(ISBLANK(VLOOKUP($K22,'E9'!$B$3:$G$22,6,FALSE)),\"\",VLOOKUP($K22,'E9'!$B$3:$G$22,6,FALSE)))","v":""},{"$f":"IF(ISNA(VLOOKUP($K22,'E10'!$B$3:$G$22,5,FALSE)),\"\",VLOOKUP($K22,'E10'!$B$3:$G$22,5,FALSE))","v":""},{"$f":"IF(ISNA((VLOOKUP($K22,'E10'!$B$3:$G$22,6,FALSE))),\"\",IF(ISBLANK(VLOOKUP($K22,'E10'!$B$3:$G$22,6,FALSE)),\"\",VLOOKUP($K22,'E10'!$B$3:$G$22,6,FALSE)))","v":""},{"$f":"IF(ISNA(VLOOKUP($K22,'E11'!$B$3:$G$22,5,FALSE)),\"\",VLOOKUP($K22,'E11'!$B$3:$G$22,5,FALSE))","v":""},{"$f":"IF(ISNA((VLOOKUP($K22,'E11'!$B$3:$G$22,6,FALSE))),\"\",IF(ISBLANK(VLOOKUP($K22,'E11'!$B$3:$G$22,6,FALSE)),\"\",VLOOKUP($K22,'E11'!$B$3:$G$22,6,FALSE)))","v":""},{"$f":"IF(ISNA(VLOOKUP($K22,'E12'!$B$3:$G$22,5,FALSE)),\"\",VLOOKUP($K22,'E12'!$B$3:$G$22,5,FALSE))","v":""},{"$f":"IF(ISNA((VLOOKUP($K22,'E12'!$B$3:$G$22,6,FALSE))),\"\",IF(ISBLANK(VLOOKUP($K22,'E12'!$B$3:$G$22,6,FALSE)),\"\",VLOOKUP($K22,'E12'!$B$3:$G$22,6,FALSE)))","v":""},{"$f":"IF(ISNA(VLOOKUP($K22,'E13'!$B$3:$G$22,5,FALSE)),\"\",VLOOKUP($K22,'E13'!$B$3:$G$22,5,FALSE))","v":""},{"$f":"IF(ISNA((VLOOKUP($K22,'E13'!$B$3:$G$22,6,FALSE))),\"\",IF(ISBLANK(VLOOKUP($K22,'E13'!$B$3:$G$22,6,FALSE)),\"\",VLOOKUP($K22,'E13'!$B$3:$G$22,6,FALSE)))","v":""},{"$f":"IF(ISNA(VLOOKUP($K22,'E14'!$B$3:$G$22,5,FALSE)),\"\",VLOOKUP($K22,'E14'!$B$3:$G$22,5,FALSE))","v":""},{"$f":"IF(ISNA((VLOOKUP($K22,'E14'!$B$3:$G$22,6,FALSE))),\"\",IF(ISBLANK(VLOOKUP($K22,'E14'!$B$3:$G$22,6,FALSE)),\"\",VLOOKUP($K22,'E14'!$B$3:$G$22,6,FALSE)))","v":""},{"$f":"IF(ISNA(VLOOKUP($K22,'E15'!$B$3:$G$22,5,FALSE)),\"\",VLOOKUP($K22,'E15'!$B$3:$G$22,5,FALSE))","v":""},{"$f":"IF(ISNA((VLOOKUP($K22,'E15'!$B$3:$G$22,6,FALSE))),\"\",IF(VLOOKUP($K22,'E15'!$B$3:$G$22,6,FALSE)=0,\"\",VLOOKUP($K22,'E15'!$B$3:$G$22,6,FALSE)))","v":""},{"$f":"IF(ISNA(VLOOKUP($K22,'E16'!$B$3:$G$22,5,FALSE)),\"\",VLOOKUP($K22,'E16'!$B$3:$G$22,5,FALSE))","v":""},{"$f":"IF(ISNA((VLOOKUP($K22,'E16'!$B$3:$G$22,6,FALSE))),\"\",IF(ISBLANK(VLOOKUP($K22,'E16'!$B$3:$G$22,6,FALSE)),\"\",VLOOKUP($K22,'E16'!$B$3:$G$22,6,FALSE)))","v":""},{"$f":"IF(ISNA(VLOOKUP($K22,'E17'!$B$3:$G$22,5,FALSE)),\"\",VLOOKUP($K22,'E17'!$B$3:$G$22,5,FALSE))","v":""},{"$f":"IF(ISNA((VLOOKUP($K22,'E17'!$B$3:$G$22,6,FALSE))),\"\",IF(ISBLANK(VLOOKUP($K22,'E17'!$B$3:$G$22,6,FALSE)),\"\",VLOOKUP($K22,'E17'!$B$3:$G$22,6,FALSE)))","v":""},{"$f":"IF(ISNA(VLOOKUP($K22,'E18'!$B$3:$G$22,5,FALSE)),\"\",VLOOKUP($K22,'E18'!$B$3:$G$22,5,FALSE))","v":""},{"$f":"IF(ISNA((VLOOKUP($K22,'E18'!$B$3:$G$22,6,FALSE))),\"\",IF(ISBLANK(VLOOKUP($K22,'E18'!$B$3:$G$22,6,FALSE)),\"\",VLOOKUP($K22,'E18'!$B$3:$G$22,6,FALSE)))","v":""},{"$f":"IF(ISNA(VLOOKUP($K22,'E19'!$B$3:$G$22,5,FALSE)),\"\",VLOOKUP($K22,'E19'!$B$3:$G$22,5,FALSE))","v":""},{"$f":"IF(ISNA((VLOOKUP($K22,'E19'!$B$3:$G$22,6,FALSE))),\"\",IF(ISBLANK(VLOOKUP($K22,'E19'!$B$3:$G$22,6,FALSE)),\"\",VLOOKUP($K22,'E19'!$B$3:$G$22,6,FALSE)))","v":""},{"$f":"IF(ISNA(VLOOKUP($K22,'E20'!$B$3:$G$22,5,FALSE)),\"\",VLOOKUP($K22,'E20'!$B$3:$G$22,5,FALSE))","v":""},{"$f":"IF(ISNA((VLOOKUP($K22,'E20'!$B$3:$G$22,6,FALSE))),\"\",IF(ISBLANK(VLOOKUP($K22,'E20'!$B$3:$G$22,6,FALSE)),\"\",VLOOKUP($K22,'E20'!$B$3:$G$22,6,FALSE)))","v":""},{"$f":"IF(ISNA(VLOOKUP($K22,'E21'!$B$3:$G$22,5,FALSE)),\"\",VLOOKUP($K22,'E21'!$B$3:$G$22,5,FALSE))","v":""},{"$f":"IF(ISNA((VLOOKUP($K22,'E21'!$B$3:$G$22,6,FALSE))),\"\",IF(ISBLANK(VLOOKUP($K22,'E21'!$B$3:$G$22,6,FALSE)),\"\",VLOOKUP($K22,'E21'!$B$3:$G$22,6,FALSE)))","v":""},{"$f":"IF(ISNA(VLOOKUP($K22,'E22'!$B$3:$G$22,5,FALSE)),\"\",VLOOKUP($K22,'E22'!$B$3:$G$22,5,FALSE))","v":""},{"$f":"IF(ISNA((VLOOKUP($K22,'E22'!$B$3:$G$22,6,FALSE))),\"\",IF(ISBLANK(VLOOKUP($K22,'E22'!$B$3:$G$22,6,FALSE)),\"\",VLOOKUP($K22,'E22'!$B$3:$G$22,6,FALSE)))","v":""},{"$f":"IF(ISNA(VLOOKUP($K22,'E23'!$B$3:$G$22,5,FALSE)),\"\",VLOOKUP($K22,'E23'!$B$3:$G$22,5,FALSE))","v":""},{"$f":"IF(ISNA((VLOOKUP($K22,'E23'!$B$3:$G$22,6,FALSE))),\"\",IF(ISBLANK(VLOOKUP($K22,'E23'!$B$3:$G$22,6,FALSE)),\"\",VLOOKUP($K22,'E23'!$B$3:$G$22,6,FALSE)))","v":""},{"$f":"IF(ISNA(VLOOKUP($K22,'E24'!$B$3:$G$22,5,FALSE)),\"\",VLOOKUP($K22,'E24'!$B$3:$G$22,5,FALSE))","v":""},{"$f":"IF(ISNA((VLOOKUP($K22,'E24'!$B$3:$G$22,6,FALSE))),\"\",IF(ISBLANK(VLOOKUP($K22,'E24'!$B$3:$G$22,6,FALSE)),\"\",VLOOKUP($K22,'E24'!$B$3:$G$22,6,FALSE)))","v":""},{"$f":"IF(ISNA(VLOOKUP($K22,'E25'!$B$3:$G$22,5,FALSE)),\"\",VLOOKUP($K22,'E25'!$B$3:$G$22,5,FALSE))","v":""},{"$f":"IF(ISNA((VLOOKUP($K22,'E25'!$B$3:$G$22,6,FALSE))),\"\",IF(ISBLANK(VLOOKUP($K22,'E25'!$B$3:$G$22,6,FALSE)),\"\",VLOOKUP($K22,'E25'!$B$3:$G$22,6,FALSE)))","v":""},{"$f":"IF(ISNA(VLOOKUP($K22,'E26'!$B$3:$G$22,5,FALSE)),\"\",VLOOKUP($K22,'E26'!$B$3:$G$22,5,FALSE))","v":""},{"$f":"IF(ISNA((VLOOKUP($K22,'E26'!$B$3:$G$22,6,FALSE))),\"\",IF(ISBLANK(VLOOKUP($K22,'E26'!$B$3:$G$22,6,FALSE)),\"\",VLOOKUP($K22,'E26'!$B$3:$G$22,6,FALSE)))","v":""},{"$f":"IF(ISNA(VLOOKUP($K22,'E27'!$B$3:$G$22,5,FALSE)),\"\",VLOOKUP($K22,'E27'!$B$3:$G$22,5,FALSE))","v":""},{"$f":"IF(ISNA((VLOOKUP($K22,'E27'!$B$3:$G$22,6,FALSE))),\"\",IF(ISBLANK(VLOOKUP($K22,'E27'!$B$3:$G$22,6,FALSE)),\"\",VLOOKUP($K22,'E27'!$B$3:$G$22,6,FALSE)))","v":""},{"$f":"IF(ISNA(VLOOKUP($K22,'E28'!$B$3:$G$22,5,FALSE)),\"\",VLOOKUP($K22,'E28'!$B$3:$G$22,5,FALSE))","v":""},{"$f":"IF(ISNA((VLOOKUP($K22,'E28'!$B$3:$G$22,6,FALSE))),\"\",IF(ISBLANK(VLOOKUP($K22,'E28'!$B$3:$G$22,6,FALSE)),\"\",VLOOKUP($K22,'E28'!$B$3:$G$22,6,FALSE)))","v":""},{"$f":"IF(ISNA(VLOOKUP($K22,'E29'!$B$3:$G$22,5,FALSE)),\"\",VLOOKUP($K22,'E29'!$B$3:$G$22,5,FALSE))","v":""},{"$f":"IF(ISNA((VLOOKUP($K22,'E29'!$B$3:$G$22,6,FALSE))),\"\",IF(ISBLANK(VLOOKUP($K22,'E29'!$B$3:$G$22,6,FALSE)),\"\",VLOOKUP($K22,'E29'!$B$3:$G$22,6,FALSE)))","v":""},{"$f":"IF(ISNA(VLOOKUP($K22,'E30'!$B$3:$G$22,5,FALSE)),\"\",VLOOKUP($K22,'E30'!$B$3:$G$22,5,FALSE))","v":""},{"$f":"IF(ISNA((VLOOKUP($K22,'E30'!$B$3:$G$22,6,FALSE))),\"\",IF(ISBLANK(VLOOKUP($K22,'E30'!$B$3:$G$22,6,FALSE)),\"\",VLOOKUP($K22,'E30'!$B$3:$G$22,6,FALSE)))","v":""}]
["E19",{"$f":"CONCATENATE('Liste classe'!E21,\" \",'Liste classe'!F21,\" \",'Liste classe'!G21,\" \",'Liste classe'!H21,\" \",'Liste classe'!I21,\" \",'Liste classe'!J21)","v":"     "},{"$f":"'E19'!$F$24","v":"00:00:00"},{"$f":"'E19'!$F$26","v":" "},{"$f":"'E19'!$G$28","v":0},{"$f":"'E19'!$I$28","v":0},{"$f":"COUNTA('E19'!$D$3:$D$22)","v":0},null,null,null,{"$f":"IF(ISBLANK(Circuits!B18),\"\",Circuits!B18)","v":""},{"$f":"IF(ISBLANK(Circuits!C18),\"\",Circuits!C18)","v":""},"","",{"$f":"IF(ISNA(VLOOKUP($K23,'E1'!$B$3:$G$22,5,FALSE)),\"\",VLOOKUP($K23,'E1'!$B$3:$G$22,5,FALSE))","v":""},{"$f":"IF(ISNA((VLOOKUP($K23,'E1'!$B$3:$G$22,6,FALSE))),\"\",IF(ISBLANK(VLOOKUP($K23,'E1'!$B$3:$G$22,6,FALSE)),\"\",VLOOKUP($K23,'E1'!$B$3:$G$22,6,FALSE)))","v":""},{"$f":"IF(ISNA(VLOOKUP($K23,'E2'!$B$3:$G$22,5,FALSE)),\"\",VLOOKUP($K23,'E2'!$B$3:$G$22,5,FALSE))","v":""},{"$f":"IF(ISNA((VLOOKUP($K23,'E2'!$B$3:$G$22,6,FALSE))),\"\",IF(ISBLANK(VLOOKUP($K23,'E2'!$B$3:$G$22,6,FALSE)),\"\",VLOOKUP($K23,'E2'!$B$3:$G$22,6,FALSE)))","v":""},{"$f":"IF(ISNA(VLOOKUP($K23,'E3'!$B$3:$G$22,5,FALSE)),\"\",VLOOKUP($K23,'E3'!$B$3:$G$22,5,FALSE))","v":""},{"$f":"IF(ISNA((VLOOKUP($K23,'E3'!$B$3:$G$22,6,FALSE))),\"\",IF(ISBLANK(VLOOKUP($K23,'E3'!$B$3:$G$22,6,FALSE)),\"\",VLOOKUP($K23,'E3'!$B$3:$G$22,6,FALSE)))","v":""},{"$f":"IF(ISNA(VLOOKUP($K23,'E4'!$B$3:$G$22,5,FALSE)),\"\",VLOOKUP($K23,'E4'!$B$3:$G$22,5,FALSE))","v":""},{"$f":"IF(ISNA((VLOOKUP($K23,'E4'!$B$3:$G$22,6,FALSE))),\"\",IF(ISBLANK(VLOOKUP($K23,'E4'!$B$3:$G$22,6,FALSE)),\"\",VLOOKUP($K23,'E4'!$B$3:$G$22,6,FALSE)))","v":""},{"$f":"IF(ISNA(VLOOKUP($K23,'E5'!$B$3:$G$22,5,FALSE)),\"\",VLOOKUP($K23,'E5'!$B$3:$G$22,5,FALSE))","v":""},{"$f":"IF(ISNA((VLOOKUP($K23,'E5'!$B$3:$G$22,6,FALSE))),\"\",IF(ISBLANK(VLOOKUP($K23,'E5'!$B$3:$G$22,6,FALSE)),\"\",VLOOKUP($K23,'E5'!$B$3:$G$22,6,FALSE)))","v":""},{"$f":"IF(ISNA(VLOOKUP($K23,'E6'!$B$3:$G$22,5,FALSE)),\"\",VLOOKUP($K23,'E6'!$B$3:$G$22,5,FALSE))","v":""},{"$f":"IF(ISNA((VLOOKUP($K23,'E6'!$B$3:$G$22,6,FALSE))),\"\",IF(ISBLANK(VLOOKUP($K23,'E6'!$B$3:$G$22,6,FALSE)),\"\",VLOOKUP($K23,'E6'!$B$3:$G$22,6,FALSE)))","v":""},{"$f":"IF(ISNA(VLOOKUP($K23,'E7'!$B$3:$G$22,5,FALSE)),\"\",VLOOKUP($K23,'E7'!$B$3:$G$22,5,FALSE))","v":""},{"$f":"IF(ISNA((VLOOKUP($K23,'E7'!$B$3:$G$22,6,FALSE))),\"\",IF(ISBLANK(VLOOKUP($K23,'E7'!$B$3:$G$22,6,FALSE)),\"\",VLOOKUP($K23,'E7'!$B$3:$G$22,6,FALSE)))","v":""},{"$f":"IF(ISNA(VLOOKUP($K23,'E8'!$B$3:$G$22,5,FALSE)),\"\",VLOOKUP($K23,'E8'!$B$3:$G$22,5,FALSE))","v":""},{"$f":"IF(ISNA((VLOOKUP($K23,'E8'!$B$3:$G$22,6,FALSE))),\"\",IF(ISBLANK(VLOOKUP($K23,'E8'!$B$3:$G$22,6,FALSE)),\"\",VLOOKUP($K23,'E8'!$B$3:$G$22,6,FALSE)))","v":""},{"$f":"IF(ISNA(VLOOKUP($K23,'E9'!$B$3:$G$22,5,FALSE)),\"\",VLOOKUP($K23,'E9'!$B$3:$G$22,5,FALSE))","v":""},{"$f":"IF(ISNA((VLOOKUP($K23,'E9'!$B$3:$G$22,6,FALSE))),\"\",IF(ISBLANK(VLOOKUP($K23,'E9'!$B$3:$G$22,6,FALSE)),\"\",VLOOKUP($K23,'E9'!$B$3:$G$22,6,FALSE)))","v":""},{"$f":"IF(ISNA(VLOOKUP($K23,'E10'!$B$3:$G$22,5,FALSE)),\"\",VLOOKUP($K23,'E10'!$B$3:$G$22,5,FALSE))","v":""},{"$f":"IF(ISNA((VLOOKUP($K23,'E10'!$B$3:$G$22,6,FALSE))),\"\",IF(ISBLANK(VLOOKUP($K23,'E10'!$B$3:$G$22,6,FALSE)),\"\",VLOOKUP($K23,'E10'!$B$3:$G$22,6,FALSE)))","v":""},{"$f":"IF(ISNA(VLOOKUP($K23,'E11'!$B$3:$G$22,5,FALSE)),\"\",VLOOKUP($K23,'E11'!$B$3:$G$22,5,FALSE))","v":""},{"$f":"IF(ISNA((VLOOKUP($K23,'E11'!$B$3:$G$22,6,FALSE))),\"\",IF(ISBLANK(VLOOKUP($K23,'E11'!$B$3:$G$22,6,FALSE)),\"\",VLOOKUP($K23,'E11'!$B$3:$G$22,6,FALSE)))","v":""},{"$f":"IF(ISNA(VLOOKUP($K23,'E12'!$B$3:$G$22,5,FALSE)),\"\",VLOOKUP($K23,'E12'!$B$3:$G$22,5,FALSE))","v":""},{"$f":"IF(ISNA((VLOOKUP($K23,'E12'!$B$3:$G$22,6,FALSE))),\"\",IF(ISBLANK(VLOOKUP($K23,'E12'!$B$3:$G$22,6,FALSE)),\"\",VLOOKUP($K23,'E12'!$B$3:$G$22,6,FALSE)))","v":""},{"$f":"IF(ISNA(VLOOKUP($K23,'E13'!$B$3:$G$22,5,FALSE)),\"\",VLOOKUP($K23,'E13'!$B$3:$G$22,5,FALSE))","v":""},{"$f":"IF(ISNA((VLOOKUP($K23,'E13'!$B$3:$G$22,6,FALSE))),\"\",IF(ISBLANK(VLOOKUP($K23,'E13'!$B$3:$G$22,6,FALSE)),\"\",VLOOKUP($K23,'E13'!$B$3:$G$22,6,FALSE)))","v":""},{"$f":"IF(ISNA(VLOOKUP($K23,'E14'!$B$3:$G$22,5,FALSE)),\"\",VLOOKUP($K23,'E14'!$B$3:$G$22,5,FALSE))","v":""},{"$f":"IF(ISNA((VLOOKUP($K23,'E14'!$B$3:$G$22,6,FALSE))),\"\",IF(ISBLANK(VLOOKUP($K23,'E14'!$B$3:$G$22,6,FALSE)),\"\",VLOOKUP($K23,'E14'!$B$3:$G$22,6,FALSE)))","v":""},{"$f":"IF(ISNA(VLOOKUP($K23,'E15'!$B$3:$G$22,5,FALSE)),\"\",VLOOKUP($K23,'E15'!$B$3:$G$22,5,FALSE))","v":""},{"$f":"IF(ISNA((VLOOKUP($K23,'E15'!$B$3:$G$22,6,FALSE))),\"\",IF(VLOOKUP($K23,'E15'!$B$3:$G$22,6,FALSE)=0,\"\",VLOOKUP($K23,'E15'!$B$3:$G$22,6,FALSE)))","v":""},{"$f":"IF(ISNA(VLOOKUP($K23,'E16'!$B$3:$G$22,5,FALSE)),\"\",VLOOKUP($K23,'E16'!$B$3:$G$22,5,FALSE))","v":""},{"$f":"IF(ISNA((VLOOKUP($K23,'E16'!$B$3:$G$22,6,FALSE))),\"\",IF(ISBLANK(VLOOKUP($K23,'E16'!$B$3:$G$22,6,FALSE)),\"\",VLOOKUP($K23,'E16'!$B$3:$G$22,6,FALSE)))","v":""},{"$f":"IF(ISNA(VLOOKUP($K23,'E17'!$B$3:$G$22,5,FALSE)),\"\",VLOOKUP($K23,'E17'!$B$3:$G$22,5,FALSE))","v":""},{"$f":"IF(ISNA((VLOOKUP($K23,'E17'!$B$3:$G$22,6,FALSE))),\"\",IF(ISBLANK(VLOOKUP($K23,'E17'!$B$3:$G$22,6,FALSE)),\"\",VLOOKUP($K23,'E17'!$B$3:$G$22,6,FALSE)))","v":""},{"$f":"IF(ISNA(VLOOKUP($K23,'E18'!$B$3:$G$22,5,FALSE)),\"\",VLOOKUP($K23,'E18'!$B$3:$G$22,5,FALSE))","v":""},{"$f":"IF(ISNA((VLOOKUP($K23,'E18'!$B$3:$G$22,6,FALSE))),\"\",IF(ISBLANK(VLOOKUP($K23,'E18'!$B$3:$G$22,6,FALSE)),\"\",VLOOKUP($K23,'E18'!$B$3:$G$22,6,FALSE)))","v":""},{"$f":"IF(ISNA(VLOOKUP($K23,'E19'!$B$3:$G$22,5,FALSE)),\"\",VLOOKUP($K23,'E19'!$B$3:$G$22,5,FALSE))","v":""},{"$f":"IF(ISNA((VLOOKUP($K23,'E19'!$B$3:$G$22,6,FALSE))),\"\",IF(ISBLANK(VLOOKUP($K23,'E19'!$B$3:$G$22,6,FALSE)),\"\",VLOOKUP($K23,'E19'!$B$3:$G$22,6,FALSE)))","v":""},{"$f":"IF(ISNA(VLOOKUP($K23,'E20'!$B$3:$G$22,5,FALSE)),\"\",VLOOKUP($K23,'E20'!$B$3:$G$22,5,FALSE))","v":""},{"$f":"IF(ISNA((VLOOKUP($K23,'E20'!$B$3:$G$22,6,FALSE))),\"\",IF(ISBLANK(VLOOKUP($K23,'E20'!$B$3:$G$22,6,FALSE)),\"\",VLOOKUP($K23,'E20'!$B$3:$G$22,6,FALSE)))","v":""},{"$f":"IF(ISNA(VLOOKUP($K23,'E21'!$B$3:$G$22,5,FALSE)),\"\",VLOOKUP($K23,'E21'!$B$3:$G$22,5,FALSE))","v":""},{"$f":"IF(ISNA((VLOOKUP($K23,'E21'!$B$3:$G$22,6,FALSE))),\"\",IF(ISBLANK(VLOOKUP($K23,'E21'!$B$3:$G$22,6,FALSE)),\"\",VLOOKUP($K23,'E21'!$B$3:$G$22,6,FALSE)))","v":""},{"$f":"IF(ISNA(VLOOKUP($K23,'E22'!$B$3:$G$22,5,FALSE)),\"\",VLOOKUP($K23,'E22'!$B$3:$G$22,5,FALSE))","v":""},{"$f":"IF(ISNA((VLOOKUP($K23,'E22'!$B$3:$G$22,6,FALSE))),\"\",IF(ISBLANK(VLOOKUP($K23,'E22'!$B$3:$G$22,6,FALSE)),\"\",VLOOKUP($K23,'E22'!$B$3:$G$22,6,FALSE)))","v":""},{"$f":"IF(ISNA(VLOOKUP($K23,'E23'!$B$3:$G$22,5,FALSE)),\"\",VLOOKUP($K23,'E23'!$B$3:$G$22,5,FALSE))","v":""},{"$f":"IF(ISNA((VLOOKUP($K23,'E23'!$B$3:$G$22,6,FALSE))),\"\",IF(ISBLANK(VLOOKUP($K23,'E23'!$B$3:$G$22,6,FALSE)),\"\",VLOOKUP($K23,'E23'!$B$3:$G$22,6,FALSE)))","v":""},{"$f":"IF(ISNA(VLOOKUP($K23,'E24'!$B$3:$G$22,5,FALSE)),\"\",VLOOKUP($K23,'E24'!$B$3:$G$22,5,FALSE))","v":""},{"$f":"IF(ISNA((VLOOKUP($K23,'E24'!$B$3:$G$22,6,FALSE))),\"\",IF(ISBLANK(VLOOKUP($K23,'E24'!$B$3:$G$22,6,FALSE)),\"\",VLOOKUP($K23,'E24'!$B$3:$G$22,6,FALSE)))","v":""},{"$f":"IF(ISNA(VLOOKUP($K23,'E25'!$B$3:$G$22,5,FALSE)),\"\",VLOOKUP($K23,'E25'!$B$3:$G$22,5,FALSE))","v":""},{"$f":"IF(ISNA((VLOOKUP($K23,'E25'!$B$3:$G$22,6,FALSE))),\"\",IF(ISBLANK(VLOOKUP($K23,'E25'!$B$3:$G$22,6,FALSE)),\"\",VLOOKUP($K23,'E25'!$B$3:$G$22,6,FALSE)))","v":""},{"$f":"IF(ISNA(VLOOKUP($K23,'E26'!$B$3:$G$22,5,FALSE)),\"\",VLOOKUP($K23,'E26'!$B$3:$G$22,5,FALSE))","v":""},{"$f":"IF(ISNA((VLOOKUP($K23,'E26'!$B$3:$G$22,6,FALSE))),\"\",IF(ISBLANK(VLOOKUP($K23,'E26'!$B$3:$G$22,6,FALSE)),\"\",VLOOKUP($K23,'E26'!$B$3:$G$22,6,FALSE)))","v":""},{"$f":"IF(ISNA(VLOOKUP($K23,'E27'!$B$3:$G$22,5,FALSE)),\"\",VLOOKUP($K23,'E27'!$B$3:$G$22,5,FALSE))","v":""},{"$f":"IF(ISNA((VLOOKUP($K23,'E27'!$B$3:$G$22,6,FALSE))),\"\",IF(ISBLANK(VLOOKUP($K23,'E27'!$B$3:$G$22,6,FALSE)),\"\",VLOOKUP($K23,'E27'!$B$3:$G$22,6,FALSE)))","v":""},{"$f":"IF(ISNA(VLOOKUP($K23,'E28'!$B$3:$G$22,5,FALSE)),\"\",VLOOKUP($K23,'E28'!$B$3:$G$22,5,FALSE))","v":""},{"$f":"IF(ISNA((VLOOKUP($K23,'E28'!$B$3:$G$22,6,FALSE))),\"\",IF(ISBLANK(VLOOKUP($K23,'E28'!$B$3:$G$22,6,FALSE)),\"\",VLOOKUP($K23,'E28'!$B$3:$G$22,6,FALSE)))","v":""},{"$f":"IF(ISNA(VLOOKUP($K23,'E29'!$B$3:$G$22,5,FALSE)),\"\",VLOOKUP($K23,'E29'!$B$3:$G$22,5,FALSE))","v":""},{"$f":"IF(ISNA((VLOOKUP($K23,'E29'!$B$3:$G$22,6,FALSE))),\"\",IF(ISBLANK(VLOOKUP($K23,'E29'!$B$3:$G$22,6,FALSE)),\"\",VLOOKUP($K23,'E29'!$B$3:$G$22,6,FALSE)))","v":""},{"$f":"IF(ISNA(VLOOKUP($K23,'E30'!$B$3:$G$22,5,FALSE)),\"\",VLOOKUP($K23,'E30'!$B$3:$G$22,5,FALSE))","v":""},{"$f":"IF(ISNA((VLOOKUP($K23,'E30'!$B$3:$G$22,6,FALSE))),\"\",IF(ISBLANK(VLOOKUP($K23,'E30'!$B$3:$G$22,6,FALSE)),\"\",VLOOKUP($K23,'E30'!$B$3:$G$22,6,FALSE)))","v":""}]
["E20",{"$f":"CONCATENATE('Liste classe'!E22,\" \",'Liste classe'!F22,\" \",'Liste classe'!G22,\" \",'Liste classe'!H22,\" \",'Liste classe'!I22,\" \",'Liste classe'!J22)","v":"     "},{"$f":"'E20'!$F$24","v":"00:00:00"},{"$f":"'E20'!$F$26","v":" "},{"$f":"'E20'!$G$28","v":0},{"$f":"'E20'!$I$28","v":0},{"$f":"COUNTA('E20'!$D$3:$D$22)","v":0},null,null,null,{"$f":"IF(ISBLANK(Circuits!B19),\"\",Circuits!B19)","v":""},{"$f":"IF(ISBLANK(Circuits!C19),\"\",Circuits!C19)","v":""},"","",{"$f":"IF(ISNA(VLOOKUP($K24,'E1'!$B$3:$G$22,5,FALSE)),\"\",VLOOKUP($K24,'E1'!$B$3:$G$22,5,FALSE))","v":""},{"$f":"IF(ISNA((VLOOKUP($K24,'E1'!$B$3:$G$22,6,FALSE))),\"\",IF(ISBLANK(VLOOKUP($K24,'E1'!$B$3:$G$22,6,FALSE)),\"\",VLOOKUP($K24,'E1'!$B$3:$G$22,6,FALSE)))","v":""},{"$f":"IF(ISNA(VLOOKUP($K24,'E2'!$B$3:$G$22,5,FALSE)),\"\",VLOOKUP($K24,'E2'!$B$3:$G$22,5,FALSE))","v":""},{"$f":"IF(ISNA((VLOOKUP($K24,'E2'!$B$3:$G$22,6,FALSE))),\"\",IF(ISBLANK(VLOOKUP($K24,'E2'!$B$3:$G$22,6,FALSE)),\"\",VLOOKUP($K24,'E2'!$B$3:$G$22,6,FALSE)))","v":""},{"$f":"IF(ISNA(VLOOKUP($K24,'E3'!$B$3:$G$22,5,FALSE)),\"\",VLOOKUP($K24,'E3'!$B$3:$G$22,5,FALSE))","v":""},{"$f":"IF(ISNA((VLOOKUP($K24,'E3'!$B$3:$G$22,6,FALSE))),\"\",IF(ISBLANK(VLOOKUP($K24,'E3'!$B$3:$G$22,6,FALSE)),\"\",VLOOKUP($K24,'E3'!$B$3:$G$22,6,FALSE)))","v":""},{"$f":"IF(ISNA(VLOOKUP($K24,'E4'!$B$3:$G$22,5,FALSE)),\"\",VLOOKUP($K24,'E4'!$B$3:$G$22,5,FALSE))","v":""},{"$f":"IF(ISNA((VLOOKUP($K24,'E4'!$B$3:$G$22,6,FALSE))),\"\",IF(ISBLANK(VLOOKUP($K24,'E4'!$B$3:$G$22,6,FALSE)),\"\",VLOOKUP($K24,'E4'!$B$3:$G$22,6,FALSE)))","v":""},{"$f":"IF(ISNA(VLOOKUP($K24,'E5'!$B$3:$G$22,5,FALSE)),\"\",VLOOKUP($K24,'E5'!$B$3:$G$22,5,FALSE))","v":""},{"$f":"IF(ISNA((VLOOKUP($K24,'E5'!$B$3:$G$22,6,FALSE))),\"\",IF(ISBLANK(VLOOKUP($K24,'E5'!$B$3:$G$22,6,FALSE)),\"\",VLOOKUP($K24,'E5'!$B$3:$G$22,6,FALSE)))","v":""},{"$f":"IF(ISNA(VLOOKUP($K24,'E6'!$B$3:$G$22,5,FALSE)),\"\",VLOOKUP($K24,'E6'!$B$3:$G$22,5,FALSE))","v":""},{"$f":"IF(ISNA((VLOOKUP($K24,'E6'!$B$3:$G$22,6,FALSE))),\"\",IF(ISBLANK(VLOOKUP($K24,'E6'!$B$3:$G$22,6,FALSE)),\"\",VLOOKUP($K24,'E6'!$B$3:$G$22,6,FALSE)))","v":""},{"$f":"IF(ISNA(VLOOKUP($K24,'E7'!$B$3:$G$22,5,FALSE)),\"\",VLOOKUP($K24,'E7'!$B$3:$G$22,5,FALSE))","v":""},{"$f":"IF(ISNA((VLOOKUP($K24,'E7'!$B$3:$G$22,6,FALSE))),\"\",IF(ISBLANK(VLOOKUP($K24,'E7'!$B$3:$G$22,6,FALSE)),\"\",VLOOKUP($K24,'E7'!$B$3:$G$22,6,FALSE)))","v":""},{"$f":"IF(ISNA(VLOOKUP($K24,'E8'!$B$3:$G$22,5,FALSE)),\"\",VLOOKUP($K24,'E8'!$B$3:$G$22,5,FALSE))","v":""},{"$f":"IF(ISNA((VLOOKUP($K24,'E8'!$B$3:$G$22,6,FALSE))),\"\",IF(ISBLANK(VLOOKUP($K24,'E8'!$B$3:$G$22,6,FALSE)),\"\",VLOOKUP($K24,'E8'!$B$3:$G$22,6,FALSE)))","v":""},{"$f":"IF(ISNA(VLOOKUP($K24,'E9'!$B$3:$G$22,5,FALSE)),\"\",VLOOKUP($K24,'E9'!$B$3:$G$22,5,FALSE))","v":""},{"$f":"IF(ISNA((VLOOKUP($K24,'E9'!$B$3:$G$22,6,FALSE))),\"\",IF(ISBLANK(VLOOKUP($K24,'E9'!$B$3:$G$22,6,FALSE)),\"\",VLOOKUP($K24,'E9'!$B$3:$G$22,6,FALSE)))","v":""},{"$f":"IF(ISNA(VLOOKUP($K24,'E10'!$B$3:$G$22,5,FALSE)),\"\",VLOOKUP($K24,'E10'!$B$3:$G$22,5,FALSE))","v":""},{"$f":"IF(ISNA((VLOOKUP($K24,'E10'!$B$3:$G$22,6,FALSE))),\"\",IF(ISBLANK(VLOOKUP($K24,'E10'!$B$3:$G$22,6,FALSE)),\"\",VLOOKUP($K24,'E10'!$B$3:$G$22,6,FALSE)))","v":""},{"$f":"IF(ISNA(VLOOKUP($K24,'E11'!$B$3:$G$22,5,FALSE)),\"\",VLOOKUP($K24,'E11'!$B$3:$G$22,5,FALSE))","v":""},{"$f":"IF(ISNA((VLOOKUP($K24,'E11'!$B$3:$G$22,6,FALSE))),\"\",IF(ISBLANK(VLOOKUP($K24,'E11'!$B$3:$G$22,6,FALSE)),\"\",VLOOKUP($K24,'E11'!$B$3:$G$22,6,FALSE)))","v":""},{"$f":"IF(ISNA(VLOOKUP($K24,'E12'!$B$3:$G$22,5,FALSE)),\"\",VLOOKUP($K24,'E12'!$B$3:$G$22,5,FALSE))","v":""},{"$f":"IF(ISNA((VLOOKUP($K24,'E12'!$B$3:$G$22,6,FALSE))),\"\",IF(ISBLANK(VLOOKUP($K24,'E12'!$B$3:$G$22,6,FALSE)),\"\",VLOOKUP($K24,'E12'!$B$3:$G$22,6,FALSE)))","v":""},{"$f":"IF(ISNA(VLOOKUP($K24,'E13'!$B$3:$G$22,5,FALSE)),\"\",VLOOKUP($K24,'E13'!$B$3:$G$22,5,FALSE))","v":""},{"$f":"IF(ISNA((VLOOKUP($K24,'E13'!$B$3:$G$22,6,FALSE))),\"\",IF(ISBLANK(VLOOKUP($K24,'E13'!$B$3:$G$22,6,FALSE)),\"\",VLOOKUP($K24,'E13'!$B$3:$G$22,6,FALSE)))","v":""},{"$f":"IF(ISNA(VLOOKUP($K24,'E14'!$B$3:$G$22,5,FALSE)),\"\",VLOOKUP($K24,'E14'!$B$3:$G$22,5,FALSE))","v":""},{"$f":"IF(ISNA((VLOOKUP($K24,'E14'!$B$3:$G$22,6,FALSE))),\"\",IF(ISBLANK(VLOOKUP($K24,'E14'!$B$3:$G$22,6,FALSE)),\"\",VLOOKUP($K24,'E14'!$B$3:$G$22,6,FALSE)))","v":""},{"$f":"IF(ISNA(VLOOKUP($K24,'E15'!$B$3:$G$22,5,FALSE)),\"\",VLOOKUP($K24,'E15'!$B$3:$G$22,5,FALSE))","v":""},{"$f":"IF(ISNA((VLOOKUP($K24,'E15'!$B$3:$G$22,6,FALSE))),\"\",IF(VLOOKUP($K24,'E15'!$B$3:$G$22,6,FALSE)=0,\"\",VLOOKUP($K24,'E15'!$B$3:$G$22,6,FALSE)))","v":""},{"$f":"IF(ISNA(VLOOKUP($K24,'E16'!$B$3:$G$22,5,FALSE)),\"\",VLOOKUP($K24,'E16'!$B$3:$G$22,5,FALSE))","v":""},{"$f":"IF(ISNA((VLOOKUP($K24,'E16'!$B$3:$G$22,6,FALSE))),\"\",IF(ISBLANK(VLOOKUP($K24,'E16'!$B$3:$G$22,6,FALSE)),\"\",VLOOKUP($K24,'E16'!$B$3:$G$22,6,FALSE)))","v":""},{"$f":"IF(ISNA(VLOOKUP($K24,'E17'!$B$3:$G$22,5,FALSE)),\"\",VLOOKUP($K24,'E17'!$B$3:$G$22,5,FALSE))","v":""},{"$f":"IF(ISNA((VLOOKUP($K24,'E17'!$B$3:$G$22,6,FALSE))),\"\",IF(ISBLANK(VLOOKUP($K24,'E17'!$B$3:$G$22,6,FALSE)),\"\",VLOOKUP($K24,'E17'!$B$3:$G$22,6,FALSE)))","v":""},{"$f":"IF(ISNA(VLOOKUP($K24,'E18'!$B$3:$G$22,5,FALSE)),\"\",VLOOKUP($K24,'E18'!$B$3:$G$22,5,FALSE))","v":""},{"$f":"IF(ISNA((VLOOKUP($K24,'E18'!$B$3:$G$22,6,FALSE))),\"\",IF(ISBLANK(VLOOKUP($K24,'E18'!$B$3:$G$22,6,FALSE)),\"\",VLOOKUP($K24,'E18'!$B$3:$G$22,6,FALSE)))","v":""},{"$f":"IF(ISNA(VLOOKUP($K24,'E19'!$B$3:$G$22,5,FALSE)),\"\",VLOOKUP($K24,'E19'!$B$3:$G$22,5,FALSE))","v":""},{"$f":"IF(ISNA((VLOOKUP($K24,'E19'!$B$3:$G$22,6,FALSE))),\"\",IF(ISBLANK(VLOOKUP($K24,'E19'!$B$3:$G$22,6,FALSE)),\"\",VLOOKUP($K24,'E19'!$B$3:$G$22,6,FALSE)))","v":""},{"$f":"IF(ISNA(VLOOKUP($K24,'E20'!$B$3:$G$22,5,FALSE)),\"\",VLOOKUP($K24,'E20'!$B$3:$G$22,5,FALSE))","v":""},{"$f":"IF(ISNA((VLOOKUP($K24,'E20'!$B$3:$G$22,6,FALSE))),\"\",IF(ISBLANK(VLOOKUP($K24,'E20'!$B$3:$G$22,6,FALSE)),\"\",VLOOKUP($K24,'E20'!$B$3:$G$22,6,FALSE)))","v":""},{"$f":"IF(ISNA(VLOOKUP($K24,'E21'!$B$3:$G$22,5,FALSE)),\"\",VLOOKUP($K24,'E21'!$B$3:$G$22,5,FALSE))","v":""},{"$f":"IF(ISNA((VLOOKUP($K24,'E21'!$B$3:$G$22,6,FALSE))),\"\",IF(ISBLANK(VLOOKUP($K24,'E21'!$B$3:$G$22,6,FALSE)),\"\",VLOOKUP($K24,'E21'!$B$3:$G$22,6,FALSE)))","v":""},{"$f":"IF(ISNA(VLOOKUP($K24,'E22'!$B$3:$G$22,5,FALSE)),\"\",VLOOKUP($K24,'E22'!$B$3:$G$22,5,FALSE))","v":""},{"$f":"IF(ISNA((VLOOKUP($K24,'E22'!$B$3:$G$22,6,FALSE))),\"\",IF(ISBLANK(VLOOKUP($K24,'E22'!$B$3:$G$22,6,FALSE)),\"\",VLOOKUP($K24,'E22'!$B$3:$G$22,6,FALSE)))","v":""},{"$f":"IF(ISNA(VLOOKUP($K24,'E23'!$B$3:$G$22,5,FALSE)),\"\",VLOOKUP($K24,'E23'!$B$3:$G$22,5,FALSE))","v":""},{"$f":"IF(ISNA((VLOOKUP($K24,'E23'!$B$3:$G$22,6,FALSE))),\"\",IF(ISBLANK(VLOOKUP($K24,'E23'!$B$3:$G$22,6,FALSE)),\"\",VLOOKUP($K24,'E23'!$B$3:$G$22,6,FALSE)))","v":""},{"$f":"IF(ISNA(VLOOKUP($K24,'E24'!$B$3:$G$22,5,FALSE)),\"\",VLOOKUP($K24,'E24'!$B$3:$G$22,5,FALSE))","v":""},{"$f":"IF(ISNA((VLOOKUP($K24,'E24'!$B$3:$G$22,6,FALSE))),\"\",IF(ISBLANK(VLOOKUP($K24,'E24'!$B$3:$G$22,6,FALSE)),\"\",VLOOKUP($K24,'E24'!$B$3:$G$22,6,FALSE)))","v":""},{"$f":"IF(ISNA(VLOOKUP($K24,'E25'!$B$3:$G$22,5,FALSE)),\"\",VLOOKUP($K24,'E25'!$B$3:$G$22,5,FALSE))","v":""},{"$f":"IF(ISNA((VLOOKUP($K24,'E25'!$B$3:$G$22,6,FALSE))),\"\",IF(ISBLANK(VLOOKUP($K24,'E25'!$B$3:$G$22,6,FALSE)),\"\",VLOOKUP($K24,'E25'!$B$3:$G$22,6,FALSE)))","v":""},{"$f":"IF(ISNA(VLOOKUP($K24,'E26'!$B$3:$G$22,5,FALSE)),\"\",VLOOKUP($K24,'E26'!$B$3:$G$22,5,FALSE))","v":""},{"$f":"IF(ISNA((VLOOKUP($K24,'E26'!$B$3:$G$22,6,FALSE))),\"\",IF(ISBLANK(VLOOKUP($K24,'E26'!$B$3:$G$22,6,FALSE)),\"\",VLOOKUP($K24,'E26'!$B$3:$G$22,6,FALSE)))","v":""},{"$f":"IF(ISNA(VLOOKUP($K24,'E27'!$B$3:$G$22,5,FALSE)),\"\",VLOOKUP($K24,'E27'!$B$3:$G$22,5,FALSE))","v":""},{"$f":"IF(ISNA((VLOOKUP($K24,'E27'!$B$3:$G$22,6,FALSE))),\"\",IF(ISBLANK(VLOOKUP($K24,'E27'!$B$3:$G$22,6,FALSE)),\"\",VLOOKUP($K24,'E27'!$B$3:$G$22,6,FALSE)))","v":""},{"$f":"IF(ISNA(VLOOKUP($K24,'E28'!$B$3:$G$22,5,FALSE)),\"\",VLOOKUP($K24,'E28'!$B$3:$G$22,5,FALSE))","v":""},{"$f":"IF(ISNA((VLOOKUP($K24,'E28'!$B$3:$G$22,6,FALSE))),\"\",IF(ISBLANK(VLOOKUP($K24,'E28'!$B$3:$G$22,6,FALSE)),\"\",VLOOKUP($K24,'E28'!$B$3:$G$22,6,FALSE)))","v":""},{"$f":"IF(ISNA(VLOOKUP($K24,'E29'!$B$3:$G$22,5,FALSE)),\"\",VLOOKUP($K24,'E29'!$B$3:$G$22,5,FALSE))","v":""},{"$f":"IF(ISNA((VLOOKUP($K24,'E29'!$B$3:$G$22,6,FALSE))),\"\",IF(ISBLANK(VLOOKUP($K24,'E29'!$B$3:$G$22,6,FALSE)),\"\",VLOOKUP($K24,'E29'!$B$3:$G$22,6,FALSE)))","v":""},{"$f":"IF(ISNA(VLOOKUP($K24,'E30'!$B$3:$G$22,5,FALSE)),\"\",VLOOKUP($K24,'E30'!$B$3:$G$22,5,FALSE))","v":""},{"$f":"IF(ISNA((VLOOKUP($K24,'E30'!$B$3:$G$22,6,FALSE))),\"\",IF(ISBLANK(VLOOKUP($K24,'E30'!$B$3:$G$22,6,FALSE)),\"\",VLOOKUP($K24,'E30'!$B$3:$G$22,6,FALSE)))","v":""}]
["E21",{"$f":"CONCATENATE('Liste classe'!E23,\" \",'Liste classe'!F23,\" \",'Liste classe'!G23,\" \",'Liste classe'!H23,\" \",'Liste classe'!I23,\" \",'Liste classe'!J23)","v":"     "},{"$f":"'E21'!$F$24","v":"00:00:00"},{"$f":"'E21'!$F$26","v":" "},{"$f":"'E21'!$G$28","v":0},{"$f":"'E21'!$I$28","v":0},{"$f":"COUNTA('E21'!$D$3:$D$22)","v":0},null,null,null,{"$f":"IF(ISBLANK(Circuits!B20),\"\",Circuits!B20)","v":""},{"$f":"IF(ISBLANK(Circuits!C20),\"\",Circuits!C20)","v":""},"","",{"$f":"IF(ISNA(VLOOKUP($K25,'E1'!$B$3:$G$22,5,FALSE)),\"\",VLOOKUP($K25,'E1'!$B$3:$G$22,5,FALSE))","v":""},{"$f":"IF(ISNA((VLOOKUP($K25,'E1'!$B$3:$G$22,6,FALSE))),\"\",IF(ISBLANK(VLOOKUP($K25,'E1'!$B$3:$G$22,6,FALSE)),\"\",VLOOKUP($K25,'E1'!$B$3:$G$22,6,FALSE)))","v":""},{"$f":"IF(ISNA(VLOOKUP($K25,'E2'!$B$3:$G$22,5,FALSE)),\"\",VLOOKUP($K25,'E2'!$B$3:$G$22,5,FALSE))","v":""},{"$f":"IF(ISNA((VLOOKUP($K25,'E2'!$B$3:$G$22,6,FALSE))),\"\",IF(ISBLANK(VLOOKUP($K25,'E2'!$B$3:$G$22,6,FALSE)),\"\",VLOOKUP($K25,'E2'!$B$3:$G$22,6,FALSE)))","v":""},{"$f":"IF(ISNA(VLOOKUP($K25,'E3'!$B$3:$G$22,5,FALSE)),\"\",VLOOKUP($K25,'E3'!$B$3:$G$22,5,FALSE))","v":""},{"$f":"IF(ISNA((VLOOKUP($K25,'E3'!$B$3:$G$22,6,FALSE))),\"\",IF(ISBLANK(VLOOKUP($K25,'E3'!$B$3:$G$22,6,FALSE)),\"\",VLOOKUP($K25,'E3'!$B$3:$G$22,6,FALSE)))","v":""},{"$f":"IF(ISNA(VLOOKUP($K25,'E4'!$B$3:$G$22,5,FALSE)),\"\",VLOOKUP($K25,'E4'!$B$3:$G$22,5,FALSE))","v":""},{"$f":"IF(ISNA((VLOOKUP($K25,'E4'!$B$3:$G$22,6,FALSE))),\"\",IF(ISBLANK(VLOOKUP($K25,'E4'!$B$3:$G$22,6,FALSE)),\"\",VLOOKUP($K25,'E4'!$B$3:$G$22,6,FALSE)))","v":""},{"$f":"IF(ISNA(VLOOKUP($K25,'E5'!$B$3:$G$22,5,FALSE)),\"\",VLOOKUP($K25,'E5'!$B$3:$G$22,5,FALSE))","v":""},{"$f":"IF(ISNA((VLOOKUP($K25,'E5'!$B$3:$G$22,6,FALSE))),\"\",IF(ISBLANK(VLOOKUP($K25,'E5'!$B$3:$G$22,6,FALSE)),\"\",VLOOKUP($K25,'E5'!$B$3:$G$22,6,FALSE)))","v":""},{"$f":"IF(ISNA(VLOOKUP($K25,'E6'!$B$3:$G$22,5,FALSE)),\"\",VLOOKUP($K25,'E6'!$B$3:$G$22,5,FALSE))","v":""},{"$f":"IF(ISNA((VLOOKUP($K25,'E6'!$B$3:$G$22,6,FALSE))),\"\",IF(ISBLANK(VLOOKUP($K25,'E6'!$B$3:$G$22,6,FALSE)),\"\",VLOOKUP($K25,'E6'!$B$3:$G$22,6,FALSE)))","v":""},{"$f":"IF(ISNA(VLOOKUP($K25,'E7'!$B$3:$G$22,5,FALSE)),\"\",VLOOKUP($K25,'E7'!$B$3:$G$22,5,FALSE))","v":""},{"$f":"IF(ISNA((VLOOKUP($K25,'E7'!$B$3:$G$22,6,FALSE))),\"\",IF(ISBLANK(VLOOKUP($K25,'E7'!$B$3:$G$22,6,FALSE)),\"\",VLOOKUP($K25,'E7'!$B$3:$G$22,6,FALSE)))","v":""},{"$f":"IF(ISNA(VLOOKUP($K25,'E8'!$B$3:$G$22,5,FALSE)),\"\",VLOOKUP($K25,'E8'!$B$3:$G$22,5,FALSE))","v":""},{"$f":"IF(ISNA((VLOOKUP($K25,'E8'!$B$3:$G$22,6,FALSE))),\"\",IF(ISBLANK(VLOOKUP($K25,'E8'!$B$3:$G$22,6,FALSE)),\"\",VLOOKUP($K25,'E8'!$B$3:$G$22,6,FALSE)))","v":""},{"$f":"IF(ISNA(VLOOKUP($K25,'E9'!$B$3:$G$22,5,FALSE)),\"\",VLOOKUP($K25,'E9'!$B$3:$G$22,5,FALSE))","v":""},{"$f":"IF(ISNA((VLOOKUP($K25,'E9'!$B$3:$G$22,6,FALSE))),\"\",IF(ISBLANK(VLOOKUP($K25,'E9'!$B$3:$G$22,6,FALSE)),\"\",VLOOKUP($K25,'E9'!$B$3:$G$22,6,FALSE)))","v":""},{"$f":"IF(ISNA(VLOOKUP($K25,'E10'!$B$3:$G$22,5,FALSE)),\"\",VLOOKUP($K25,'E10'!$B$3:$G$22,5,FALSE))","v":""},{"$f":"IF(ISNA((VLOOKUP($K25,'E10'!$B$3:$G$22,6,FALSE))),\"\",IF(ISBLANK(VLOOKUP($K25,'E10'!$B$3:$G$22,6,FALSE)),\"\",VLOOKUP($K25,'E10'!$B$3:$G$22,6,FALSE)))","v":""},{"$f":"IF(ISNA(VLOOKUP($K25,'E11'!$B$3:$G$22,5,FALSE)),\"\",VLOOKUP($K25,'E11'!$B$3:$G$22,5,FALSE))","v":""},{"$f":"IF(ISNA((VLOOKUP($K25,'E11'!$B$3:$G$22,6,FALSE))),\"\",IF(ISBLANK(VLOOKUP($K25,'E11'!$B$3:$G$22,6,FALSE)),\"\",VLOOKUP($K25,'E11'!$B$3:$G$22,6,FALSE)))","v":""},{"$f":"IF(ISNA(VLOOKUP($K25,'E12'!$B$3:$G$22,5,FALSE)),\"\",VLOOKUP($K25,'E12'!$B$3:$G$22,5,FALSE))","v":""},{"$f":"IF(ISNA((VLOOKUP($K25,'E12'!$B$3:$G$22,6,FALSE))),\"\",IF(ISBLANK(VLOOKUP($K25,'E12'!$B$3:$G$22,6,FALSE)),\"\",VLOOKUP($K25,'E12'!$B$3:$G$22,6,FALSE)))","v":""},{"$f":"IF(ISNA(VLOOKUP($K25,'E13'!$B$3:$G$22,5,FALSE)),\"\",VLOOKUP($K25,'E13'!$B$3:$G$22,5,FALSE))","v":""},{"$f":"IF(ISNA((VLOOKUP($K25,'E13'!$B$3:$G$22,6,FALSE))),\"\",IF(ISBLANK(VLOOKUP($K25,'E13'!$B$3:$G$22,6,FALSE)),\"\",VLOOKUP($K25,'E13'!$B$3:$G$22,6,FALSE)))","v":""},{"$f":"IF(ISNA(VLOOKUP($K25,'E14'!$B$3:$G$22,5,FALSE)),\"\",VLOOKUP($K25,'E14'!$B$3:$G$22,5,FALSE))","v":""},{"$f":"IF(ISNA((VLOOKUP($K25,'E14'!$B$3:$G$22,6,FALSE))),\"\",IF(ISBLANK(VLOOKUP($K25,'E14'!$B$3:$G$22,6,FALSE)),\"\",VLOOKUP($K25,'E14'!$B$3:$G$22,6,FALSE)))","v":""},{"$f":"IF(ISNA(VLOOKUP($K25,'E15'!$B$3:$G$22,5,FALSE)),\"\",VLOOKUP($K25,'E15'!$B$3:$G$22,5,FALSE))","v":""},{"$f":"IF(ISNA((VLOOKUP($K25,'E15'!$B$3:$G$22,6,FALSE))),\"\",IF(VLOOKUP($K25,'E15'!$B$3:$G$22,6,FALSE)=0,\"\",VLOOKUP($K25,'E15'!$B$3:$G$22,6,FALSE)))","v":""},{"$f":"IF(ISNA(VLOOKUP($K25,'E16'!$B$3:$G$22,5,FALSE)),\"\",VLOOKUP($K25,'E16'!$B$3:$G$22,5,FALSE))","v":""},{"$f":"IF(ISNA((VLOOKUP($K25,'E16'!$B$3:$G$22,6,FALSE))),\"\",IF(ISBLANK(VLOOKUP($K25,'E16'!$B$3:$G$22,6,FALSE)),\"\",VLOOKUP($K25,'E16'!$B$3:$G$22,6,FALSE)))","v":""},{"$f":"IF(ISNA(VLOOKUP($K25,'E17'!$B$3:$G$22,5,FALSE)),\"\",VLOOKUP($K25,'E17'!$B$3:$G$22,5,FALSE))","v":""},{"$f":"IF(ISNA((VLOOKUP($K25,'E17'!$B$3:$G$22,6,FALSE))),\"\",IF(ISBLANK(VLOOKUP($K25,'E17'!$B$3:$G$22,6,FALSE)),\"\",VLOOKUP($K25,'E17'!$B$3:$G$22,6,FALSE)))","v":""},{"$f":"IF(ISNA(VLOOKUP($K25,'E18'!$B$3:$G$22,5,FALSE)),\"\",VLOOKUP($K25,'E18'!$B$3:$G$22,5,FALSE))","v":""},{"$f":"IF(ISNA((VLOOKUP($K25,'E18'!$B$3:$G$22,6,FALSE))),\"\",IF(ISBLANK(VLOOKUP($K25,'E18'!$B$3:$G$22,6,FALSE)),\"\",VLOOKUP($K25,'E18'!$B$3:$G$22,6,FALSE)))","v":""},{"$f":"IF(ISNA(VLOOKUP($K25,'E19'!$B$3:$G$22,5,FALSE)),\"\",VLOOKUP($K25,'E19'!$B$3:$G$22,5,FALSE))","v":""},{"$f":"IF(ISNA((VLOOKUP($K25,'E19'!$B$3:$G$22,6,FALSE))),\"\",IF(ISBLANK(VLOOKUP($K25,'E19'!$B$3:$G$22,6,FALSE)),\"\",VLOOKUP($K25,'E19'!$B$3:$G$22,6,FALSE)))","v":""},{"$f":"IF(ISNA(VLOOKUP($K25,'E20'!$B$3:$G$22,5,FALSE)),\"\",VLOOKUP($K25,'E20'!$B$3:$G$22,5,FALSE))","v":""},{"$f":"IF(ISNA((VLOOKUP($K25,'E20'!$B$3:$G$22,6,FALSE))),\"\",IF(ISBLANK(VLOOKUP($K25,'E20'!$B$3:$G$22,6,FALSE)),\"\",VLOOKUP($K25,'E20'!$B$3:$G$22,6,FALSE)))","v":""},{"$f":"IF(ISNA(VLOOKUP($K25,'E21'!$B$3:$G$22,5,FALSE)),\"\",VLOOKUP($K25,'E21'!$B$3:$G$22,5,FALSE))","v":""},{"$f":"IF(ISNA((VLOOKUP($K25,'E21'!$B$3:$G$22,6,FALSE))),\"\",IF(ISBLANK(VLOOKUP($K25,'E21'!$B$3:$G$22,6,FALSE)),\"\",VLOOKUP($K25,'E21'!$B$3:$G$22,6,FALSE)))","v":""},{"$f":"IF(ISNA(VLOOKUP($K25,'E22'!$B$3:$G$22,5,FALSE)),\"\",VLOOKUP($K25,'E22'!$B$3:$G$22,5,FALSE))","v":""},{"$f":"IF(ISNA((VLOOKUP($K25,'E22'!$B$3:$G$22,6,FALSE))),\"\",IF(ISBLANK(VLOOKUP($K25,'E22'!$B$3:$G$22,6,FALSE)),\"\",VLOOKUP($K25,'E22'!$B$3:$G$22,6,FALSE)))","v":""},{"$f":"IF(ISNA(VLOOKUP($K25,'E23'!$B$3:$G$22,5,FALSE)),\"\",VLOOKUP($K25,'E23'!$B$3:$G$22,5,FALSE))","v":""},{"$f":"IF(ISNA((VLOOKUP($K25,'E23'!$B$3:$G$22,6,FALSE))),\"\",IF(ISBLANK(VLOOKUP($K25,'E23'!$B$3:$G$22,6,FALSE)),\"\",VLOOKUP($K25,'E23'!$B$3:$G$22,6,FALSE)))","v":""},{"$f":"IF(ISNA(VLOOKUP($K25,'E24'!$B$3:$G$22,5,FALSE)),\"\",VLOOKUP($K25,'E24'!$B$3:$G$22,5,FALSE))","v":""},{"$f":"IF(ISNA((VLOOKUP($K25,'E24'!$B$3:$G$22,6,FALSE))),\"\",IF(ISBLANK(VLOOKUP($K25,'E24'!$B$3:$G$22,6,FALSE)),\"\",VLOOKUP($K25,'E24'!$B$3:$G$22,6,FALSE)))","v":""},{"$f":"IF(ISNA(VLOOKUP($K25,'E25'!$B$3:$G$22,5,FALSE)),\"\",VLOOKUP($K25,'E25'!$B$3:$G$22,5,FALSE))","v":""},{"$f":"IF(ISNA((VLOOKUP($K25,'E25'!$B$3:$G$22,6,FALSE))),\"\",IF(ISBLANK(VLOOKUP($K25,'E25'!$B$3:$G$22,6,FALSE)),\"\",VLOOKUP($K25,'E25'!$B$3:$G$22,6,FALSE)))","v":""},{"$f":"IF(ISNA(VLOOKUP($K25,'E26'!$B$3:$G$22,5,FALSE)),\"\",VLOOKUP($K25,'E26'!$B$3:$G$22,5,FALSE))","v":""},{"$f":"IF(ISNA((VLOOKUP($K25,'E26'!$B$3:$G$22,6,FALSE))),\"\",IF(ISBLANK(VLOOKUP($K25,'E26'!$B$3:$G$22,6,FALSE)),\"\",VLOOKUP($K25,'E26'!$B$3:$G$22,6,FALSE)))","v":""},{"$f":"IF(ISNA(VLOOKUP($K25,'E27'!$B$3:$G$22,5,FALSE)),\"\",VLOOKUP($K25,'E27'!$B$3:$G$22,5,FALSE))","v":""},{"$f":"IF(ISNA((VLOOKUP($K25,'E27'!$B$3:$G$22,6,FALSE))),\"\",IF(ISBLANK(VLOOKUP($K25,'E27'!$B$3:$G$22,6,FALSE)),\"\",VLOOKUP($K25,'E27'!$B$3:$G$22,6,FALSE)))","v":""},{"$f":"IF(ISNA(VLOOKUP($K25,'E28'!$B$3:$G$22,5,FALSE)),\"\",VLOOKUP($K25,'E28'!$B$3:$G$22,5,FALSE))","v":""},{"$f":"IF(ISNA((VLOOKUP($K25,'E28'!$B$3:$G$22,6,FALSE))),\"\",IF(ISBLANK(VLOOKUP($K25,'E28'!$B$3:$G$22,6,FALSE)),\"\",VLOOKUP($K25,'E28'!$B$3:$G$22,6,FALSE)))","v":""},{"$f":"IF(ISNA(VLOOKUP($K25,'E29'!$B$3:$G$22,5,FALSE)),\"\",VLOOKUP($K25,'E29'!$B$3:$G$22,5,FALSE))","v":""},{"$f":"IF(ISNA((VLOOKUP($K25,'E29'!$B$3:$G$22,6,FALSE))),\"\",IF(ISBLANK(VLOOKUP($K25,'E29'!$B$3:$G$22,6,FALSE)),\"\",VLOOKUP($K25,'E29'!$B$3:$G$22,6,FALSE)))","v":""},{"$f":"IF(ISNA(VLOOKUP($K25,'E30'!$B$3:$G$22,5,FALSE)),\"\",VLOOKUP($K25,'E30'!$B$3:$G$22,5,FALSE))","v":""},{"$f":"IF(ISNA((VLOOKUP($K25,'E30'!$B$3:$G$22,6,FALSE))),\"\",IF(ISBLANK(VLOOKUP($K25,'E30'!$B$3:$G$22,6,FALSE)),\"\",VLOOKUP($K25,'E30'!$B$3:$G$22,6,FALSE)))","v":""}]
["E22",{"$f":"CONCATENATE('Liste classe'!E24,\" \",'Liste classe'!F24,\" \",'Liste classe'!G24,\" \",'Liste classe'!H24,\" \",'Liste classe'!I24,\" \",'Liste classe'!J24)","v":"     "},{"$f":"'E22'!$F$24","v":"00:00:00"},{"$f":"'E22'!$F$26","v":" "},{"$f":"'E22'!$G$28","v":0},{"$f":"'E22'!$I$28","v":0},{"$f":"COUNTA('E22'!$D$3:$D$22)","v":0},null,null,null,{"$f":"IF(ISBLANK(Circuits!B21),\"\",Circuits!B21)","v":""},{"$f":"IF(ISBLANK(Circuits!C21),\"\",Circuits!C21)","v":""},"","",{"$f":"IF(ISNA(VLOOKUP($K26,'E1'!$B$3:$G$22,5,FALSE)),\"\",VLOOKUP($K26,'E1'!$B$3:$G$22,5,FALSE))","v":""},{"$f":"IF(ISNA((VLOOKUP($K26,'E1'!$B$3:$G$22,6,FALSE))),\"\",IF(ISBLANK(VLOOKUP($K26,'E1'!$B$3:$G$22,6,FALSE)),\"\",VLOOKUP($K26,'E1'!$B$3:$G$22,6,FALSE)))","v":""},{"$f":"IF(ISNA(VLOOKUP($K26,'E2'!$B$3:$G$22,5,FALSE)),\"\",VLOOKUP($K26,'E2'!$B$3:$G$22,5,FALSE))","v":""},{"$f":"IF(ISNA((VLOOKUP($K26,'E2'!$B$3:$G$22,6,FALSE))),\"\",IF(ISBLANK(VLOOKUP($K26,'E2'!$B$3:$G$22,6,FALSE)),\"\",VLOOKUP($K26,'E2'!$B$3:$G$22,6,FALSE)))","v":""},{"$f":"IF(ISNA(VLOOKUP($K26,'E3'!$B$3:$G$22,5,FALSE)),\"\",VLOOKUP($K26,'E3'!$B$3:$G$22,5,FALSE))","v":""},{"$f":"IF(ISNA((VLOOKUP($K26,'E3'!$B$3:$G$22,6,FALSE))),\"\",IF(ISBLANK(VLOOKUP($K26,'E3'!$B$3:$G$22,6,FALSE)),\"\",VLOOKUP($K26,'E3'!$B$3:$G$22,6,FALSE)))","v":""},{"$f":"IF(ISNA(VLOOKUP($K26,'E4'!$B$3:$G$22,5,FALSE)),\"\",VLOOKUP($K26,'E4'!$B$3:$G$22,5,FALSE))","v":""},{"$f":"IF(ISNA((VLOOKUP($K26,'E4'!$B$3:$G$22,6,FALSE))),\"\",IF(ISBLANK(VLOOKUP($K26,'E4'!$B$3:$G$22,6,FALSE)),\"\",VLOOKUP($K26,'E4'!$B$3:$G$22,6,FALSE)))","v":""},{"$f":"IF(ISNA(VLOOKUP($K26,'E5'!$B$3:$G$22,5,FALSE)),\"\",VLOOKUP($K26,'E5'!$B$3:$G$22,5,FALSE))","v":""},{"$f":"IF(ISNA((VLOOKUP($K26,'E5'!$B$3:$G$22,6,FALSE))),\"\",IF(ISBLANK(VLOOKUP($K26,'E5'!$B$3:$G$22,6,FALSE)),\"\",VLOOKUP($K26,'E5'!$B$3:$G$22,6,FALSE)))","v":""},{"$f":"IF(ISNA(VLOOKUP($K26,'E6'!$B$3:$G$22,5,FALSE)),\"\",VLOOKUP($K26,'E6'!$B$3:$G$22,5,FALSE))","v":""},{"$f":"IF(ISNA((VLOOKUP($K26,'E6'!$B$3:$G$22,6,FALSE))),\"\",IF(ISBLANK(VLOOKUP($K26,'E6'!$B$3:$G$22,6,FALSE)),\"\",VLOOKUP($K26,'E6'!$B$3:$G$22,6,FALSE)))","v":""},{"$f":"IF(ISNA(VLOOKUP($K26,'E7'!$B$3:$G$22,5,FALSE)),\"\",VLOOKUP($K26,'E7'!$B$3:$G$22,5,FALSE))","v":""},{"$f":"IF(ISNA((VLOOKUP($K26,'E7'!$B$3:$G$22,6,FALSE))),\"\",IF(ISBLANK(VLOOKUP($K26,'E7'!$B$3:$G$22,6,FALSE)),\"\",VLOOKUP($K26,'E7'!$B$3:$G$22,6,FALSE)))","v":""},{"$f":"IF(ISNA(VLOOKUP($K26,'E8'!$B$3:$G$22,5,FALSE)),\"\",VLOOKUP($K26,'E8'!$B$3:$G$22,5,FALSE))","v":""},{"$f":"IF(ISNA((VLOOKUP($K26,'E8'!$B$3:$G$22,6,FALSE))),\"\",IF(ISBLANK(VLOOKUP($K26,'E8'!$B$3:$G$22,6,FALSE)),\"\",VLOOKUP($K26,'E8'!$B$3:$G$22,6,FALSE)))","v":""},{"$f":"IF(ISNA(VLOOKUP($K26,'E9'!$B$3:$G$22,5,FALSE)),\"\",VLOOKUP($K26,'E9'!$B$3:$G$22,5,FALSE))","v":""},{"$f":"IF(ISNA((VLOOKUP($K26,'E9'!$B$3:$G$22,6,FALSE))),\"\",IF(ISBLANK(VLOOKUP($K26,'E9'!$B$3:$G$22,6,FALSE)),\"\",VLOOKUP($K26,'E9'!$B$3:$G$22,6,FALSE)))","v":""},{"$f":"IF(ISNA(VLOOKUP($K26,'E10'!$B$3:$G$22,5,FALSE)),\"\",VLOOKUP($K26,'E10'!$B$3:$G$22,5,FALSE))","v":""},{"$f":"IF(ISNA((VLOOKUP($K26,'E10'!$B$3:$G$22,6,FALSE))),\"\",IF(ISBLANK(VLOOKUP($K26,'E10'!$B$3:$G$22,6,FALSE)),\"\",VLOOKUP($K26,'E10'!$B$3:$G$22,6,FALSE)))","v":""},{"$f":"IF(ISNA(VLOOKUP($K26,'E11'!$B$3:$G$22,5,FALSE)),\"\",VLOOKUP($K26,'E11'!$B$3:$G$22,5,FALSE))","v":""},{"$f":"IF(ISNA((VLOOKUP($K26,'E11'!$B$3:$G$22,6,FALSE))),\"\",IF(ISBLANK(VLOOKUP($K26,'E11'!$B$3:$G$22,6,FALSE)),\"\",VLOOKUP($K26,'E11'!$B$3:$G$22,6,FALSE)))","v":""},{"$f":"IF(ISNA(VLOOKUP($K26,'E12'!$B$3:$G$22,5,FALSE)),\"\",VLOOKUP($K26,'E12'!$B$3:$G$22,5,FALSE))","v":""},{"$f":"IF(ISNA((VLOOKUP($K26,'E12'!$B$3:$G$22,6,FALSE))),\"\",IF(ISBLANK(VLOOKUP($K26,'E12'!$B$3:$G$22,6,FALSE)),\"\",VLOOKUP($K26,'E12'!$B$3:$G$22,6,FALSE)))","v":""},{"$f":"IF(ISNA(VLOOKUP($K26,'E13'!$B$3:$G$22,5,FALSE)),\"\",VLOOKUP($K26,'E13'!$B$3:$G$22,5,FALSE))","v":""},{"$f":"IF(ISNA((VLOOKUP($K26,'E13'!$B$3:$G$22,6,FALSE))),\"\",IF(ISBLANK(VLOOKUP($K26,'E13'!$B$3:$G$22,6,FALSE)),\"\",VLOOKUP($K26,'E13'!$B$3:$G$22,6,FALSE)))","v":""},{"$f":"IF(ISNA(VLOOKUP($K26,'E14'!$B$3:$G$22,5,FALSE)),\"\",VLOOKUP($K26,'E14'!$B$3:$G$22,5,FALSE))","v":""},{"$f":"IF(ISNA((VLOOKUP($K26,'E14'!$B$3:$G$22,6,FALSE))),\"\",IF(ISBLANK(VLOOKUP($K26,'E14'!$B$3:$G$22,6,FALSE)),\"\",VLOOKUP($K26,'E14'!$B$3:$G$22,6,FALSE)))","v":""},{"$f":"IF(ISNA(VLOOKUP($K26,'E15'!$B$3:$G$22,5,FALSE)),\"\",VLOOKUP($K26,'E15'!$B$3:$G$22,5,FALSE))","v":""},{"$f":"IF(ISNA((VLOOKUP($K26,'E15'!$B$3:$G$22,6,FALSE))),\"\",IF(VLOOKUP($K26,'E15'!$B$3:$G$22,6,FALSE)=0,\"\",VLOOKUP($K26,'E15'!$B$3:$G$22,6,FALSE)))","v":""},{"$f":"IF(ISNA(VLOOKUP($K26,'E16'!$B$3:$G$22,5,FALSE)),\"\",VLOOKUP($K26,'E16'!$B$3:$G$22,5,FALSE))","v":""},{"$f":"IF(ISNA((VLOOKUP($K26,'E16'!$B$3:$G$22,6,FALSE))),\"\",IF(ISBLANK(VLOOKUP($K26,'E16'!$B$3:$G$22,6,FALSE)),\"\",VLOOKUP($K26,'E16'!$B$3:$G$22,6,FALSE)))","v":""},{"$f":"IF(ISNA(VLOOKUP($K26,'E17'!$B$3:$G$22,5,FALSE)),\"\",VLOOKUP($K26,'E17'!$B$3:$G$22,5,FALSE))","v":""},{"$f":"IF(ISNA((VLOOKUP($K26,'E17'!$B$3:$G$22,6,FALSE))),\"\",IF(ISBLANK(VLOOKUP($K26,'E17'!$B$3:$G$22,6,FALSE)),\"\",VLOOKUP($K26,'E17'!$B$3:$G$22,6,FALSE)))","v":""},{"$f":"IF(ISNA(VLOOKUP($K26,'E18'!$B$3:$G$22,5,FALSE)),\"\",VLOOKUP($K26,'E18'!$B$3:$G$22,5,FALSE))","v":""},{"$f":"IF(ISNA((VLOOKUP($K26,'E18'!$B$3:$G$22,6,FALSE))),\"\",IF(ISBLANK(VLOOKUP($K26,'E18'!$B$3:$G$22,6,FALSE)),\"\",VLOOKUP($K26,'E18'!$B$3:$G$22,6,FALSE)))","v":""},{"$f":"IF(ISNA(VLOOKUP($K26,'E19'!$B$3:$G$22,5,FALSE)),\"\",VLOOKUP($K26,'E19'!$B$3:$G$22,5,FALSE))","v":""},{"$f":"IF(ISNA((VLOOKUP($K26,'E19'!$B$3:$G$22,6,FALSE))),\"\",IF(ISBLANK(VLOOKUP($K26,'E19'!$B$3:$G$22,6,FALSE)),\"\",VLOOKUP($K26,'E19'!$B$3:$G$22,6,FALSE)))","v":""},{"$f":"IF(ISNA(VLOOKUP($K26,'E20'!$B$3:$G$22,5,FALSE)),\"\",VLOOKUP($K26,'E20'!$B$3:$G$22,5,FALSE))","v":""},{"$f":"IF(ISNA((VLOOKUP($K26,'E20'!$B$3:$G$22,6,FALSE))),\"\",IF(ISBLANK(VLOOKUP($K26,'E20'!$B$3:$G$22,6,FALSE)),\"\",VLOOKUP($K26,'E20'!$B$3:$G$22,6,FALSE)))","v":""},{"$f":"IF(ISNA(VLOOKUP($K26,'E21'!$B$3:$G$22,5,FALSE)),\"\",VLOOKUP($K26,'E21'!$B$3:$G$22,5,FALSE))","v":""},{"$f":"IF(ISNA((VLOOKUP($K26,'E21'!$B$3:$G$22,6,FALSE))),\"\",IF(ISBLANK(VLOOKUP($K26,'E21'!$B$3:$G$22,6,FALSE)),\"\",VLOOKUP($K26,'E21'!$B$3:$G$22,6,FALSE)))","v":""},{"$f":"IF(ISNA(VLOOKUP($K26,'E22'!$B$3:$G$22,5,FALSE)),\"\",VLOOKUP($K26,'E22'!$B$3:$G$22,5,FALSE))","v":""},{"$f":"IF(ISNA((VLOOKUP($K26,'E22'!$B$3:$G$22,6,FALSE))),\"\",IF(ISBLANK(VLOOKUP($K26,'E22'!$B$3:$G$22,6,FALSE)),\"\",VLOOKUP($K26,'E22'!$B$3:$G$22,6,FALSE)))","v":""},{"$f":"IF(ISNA(VLOOKUP($K26,'E23'!$B$3:$G$22,5,FALSE)),\"\",VLOOKUP($K26,'E23'!$B$3:$G$22,5,FALSE))","v":""},{"$f":"IF(ISNA((VLOOKUP($K26,'E23'!$B$3:$G$22,6,FALSE))),\"\",IF(ISBLANK(VLOOKUP($K26,'E23'!$B$3:$G$22,6,FALSE)),\"\",VLOOKUP($K26,'E23'!$B$3:$G$22,6,FALSE)))","v":""},{"$f":"IF(ISNA(VLOOKUP($K26,'E24'!$B$3:$G$22,5,FALSE)),\"\",VLOOKUP($K26,'E24'!$B$3:$G$22,5,FALSE))","v":""},{"$f":"IF(ISNA((VLOOKUP($K26,'E24'!$B$3:$G$22,6,FALSE))),\"\",IF(ISBLANK(VLOOKUP($K26,'E24'!$B$3:$G$22,6,FALSE)),\"\",VLOOKUP($K26,'E24'!$B$3:$G$22,6,FALSE)))","v":""},{"$f":"IF(ISNA(VLOOKUP($K26,'E25'!$B$3:$G$22,5,FALSE)),\"\",VLOOKUP($K26,'E25'!$B$3:$G$22,5,FALSE))","v":""},{"$f":"IF(ISNA((VLOOKUP($K26,'E25'!$B$3:$G$22,6,FALSE))),\"\",IF(ISBLANK(VLOOKUP($K26,'E25'!$B$3:$G$22,6,FALSE)),\"\",VLOOKUP($K26,'E25'!$B$3:$G$22,6,FALSE)))","v":""},{"$f":"IF(ISNA(VLOOKUP($K26,'E26'!$B$3:$G$22,5,FALSE)),\"\",VLOOKUP($K26,'E26'!$B$3:$G$22,5,FALSE))","v":""},{"$f":"IF(ISNA((VLOOKUP($K26,'E26'!$B$3:$G$22,6,FALSE))),\"\",IF(ISBLANK(VLOOKUP($K26,'E26'!$B$3:$G$22,6,FALSE)),\"\",VLOOKUP($K26,'E26'!$B$3:$G$22,6,FALSE)))","v":""},{"$f":"IF(ISNA(VLOOKUP($K26,'E27'!$B$3:$G$22,5,FALSE)),\"\",VLOOKUP($K26,'E27'!$B$3:$G$22,5,FALSE))","v":""},{"$f":"IF(ISNA((VLOOKUP($K26,'E27'!$B$3:$G$22,6,FALSE))),\"\",IF(ISBLANK(VLOOKUP($K26,'E27'!$B$3:$G$22,6,FALSE)),\"\",VLOOKUP($K26,'E27'!$B$3:$G$22,6,FALSE)))","v":""},{"$f":"IF(ISNA(VLOOKUP($K26,'E28'!$B$3:$G$22,5,FALSE)),\"\",VLOOKUP($K26,'E28'!$B$3:$G$22,5,FALSE))","v":""},{"$f":"IF(ISNA((VLOOKUP($K26,'E28'!$B$3:$G$22,6,FALSE))),\"\",IF(ISBLANK(VLOOKUP($K26,'E28'!$B$3:$G$22,6,FALSE)),\"\",VLOOKUP($K26,'E28'!$B$3:$G$22,6,FALSE)))","v":""},{"$f":"IF(ISNA(VLOOKUP($K26,'E29'!$B$3:$G$22,5,FALSE)),\"\",VLOOKUP($K26,'E29'!$B$3:$G$22,5,FALSE))","v":""},{"$f":"IF(ISNA((VLOOKUP($K26,'E29'!$B$3:$G$22,6,FALSE))),\"\",IF(ISBLANK(VLOOKUP($K26,'E29'!$B$3:$G$22,6,FALSE)),\"\",VLOOKUP($K26,'E29'!$B$3:$G$22,6,FALSE)))","v":""},{"$f":"IF(ISNA(VLOOKUP($K26,'E30'!$B$3:$G$22,5,FALSE)),\"\",VLOOKUP($K26,'E30'!$B$3:$G$22,5,FALSE))","v":""},{"$f":"IF(ISNA((VLOOKUP($K26,'E30'!$B$3:$G$22,6,FALSE))),\"\",IF(ISBLANK(VLOOKUP($K26,'E30'!$B$3:$G$22,6,FALSE)),\"\",VLOOKUP($K26,'E30'!$B$3:$G$22,6,FALSE)))","v":""}]
["E23",{"$f":"CONCATENATE('Liste classe'!E25,\" \",'Liste classe'!F25,\" \",'Liste classe'!G25,\" \",'Liste classe'!H25,\" \",'Liste classe'!I25,\" \",'Liste classe'!J25)","v":"     "},{"$f":"'E23'!$F$24","v":"00:00:00"},{"$f":"'E23'!$F$26","v":" "},{"$f":"'E23'!$G$28","v":0},{"$f":"'E23'!$I$28","v":0},{"$f":"COUNTA('E23'!$D$3:$D$22)","v":0},null,null,null,{"$f":"IF(ISBLANK(Circuits!B22),\"\",Circuits!B22)","v":""},{"$f":"IF(ISBLANK(Circuits!C22),\"\",Circuits!C22)","v":""},"","",{"$f":"IF(ISNA(VLOOKUP($K27,'E1'!$B$3:$G$22,5,FALSE)),\"\",VLOOKUP($K27,'E1'!$B$3:$G$22,5,FALSE))","v":""},{"$f":"IF(ISNA((VLOOKUP($K27,'E1'!$B$3:$G$22,6,FALSE))),\"\",IF(ISBLANK(VLOOKUP($K27,'E1'!$B$3:$G$22,6,FALSE)),\"\",VLOOKUP($K27,'E1'!$B$3:$G$22,6,FALSE)))","v":""},{"$f":"IF(ISNA(VLOOKUP($K27,'E2'!$B$3:$G$22,5,FALSE)),\"\",VLOOKUP($K27,'E2'!$B$3:$G$22,5,FALSE))","v":""},{"$f":"IF(ISNA((VLOOKUP($K27,'E2'!$B$3:$G$22,6,FALSE))),\"\",IF(ISBLANK(VLOOKUP($K27,'E2'!$B$3:$G$22,6,FALSE)),\"\",VLOOKUP($K27,'E2'!$B$3:$G$22,6,FALSE)))","v":""},{"$f":"IF(ISNA(VLOOKUP($K27,'E3'!$B$3:$G$22,5,FALSE)),\"\",VLOOKUP($K27,'E3'!$B$3:$G$22,5,FALSE))","v":""},{"$f":"IF(ISNA((VLOOKUP($K27,'E3'!$B$3:$G$22,6,FALSE))),\"\",IF(ISBLANK(VLOOKUP($K27,'E3'!$B$3:$G$22,6,FALSE)),\"\",VLOOKUP($K27,'E3'!$B$3:$G$22,6,FALSE)))","v":""},{"$f":"IF(ISNA(VLOOKUP($K27,'E4'!$B$3:$G$22,5,FALSE)),\"\",VLOOKUP($K27,'E4'!$B$3:$G$22,5,FALSE))","v":""},{"$f":"IF(ISNA((VLOOKUP($K27,'E4'!$B$3:$G$22,6,FALSE))),\"\",IF(ISBLANK(VLOOKUP($K27,'E4'!$B$3:$G$22,6,FALSE)),\"\",VLOOKUP($K27,'E4'!$B$3:$G$22,6,FALSE)))","v":""},{"$f":"IF(ISNA(VLOOKUP($K27,'E5'!$B$3:$G$22,5,FALSE)),\"\",VLOOKUP($K27,'E5'!$B$3:$G$22,5,FALSE))","v":""},{"$f":"IF(ISNA((VLOOKUP($K27,'E5'!$B$3:$G$22,6,FALSE))),\"\",IF(ISBLANK(VLOOKUP($K27,'E5'!$B$3:$G$22,6,FALSE)),\"\",VLOOKUP($K27,'E5'!$B$3:$G$22,6,FALSE)))","v":""},{"$f":"IF(ISNA(VLOOKUP($K27,'E6'!$B$3:$G$22,5,FALSE)),\"\",VLOOKUP($K27,'E6'!$B$3:$G$22,5,FALSE))","v":""},{"$f":"IF(ISNA((VLOOKUP($K27,'E6'!$B$3:$G$22,6,FALSE))),\"\",IF(ISBLANK(VLOOKUP($K27,'E6'!$B$3:$G$22,6,FALSE)),\"\",VLOOKUP($K27,'E6'!$B$3:$G$22,6,FALSE)))","v":""},{"$f":"IF(ISNA(VLOOKUP($K27,'E7'!$B$3:$G$22,5,FALSE)),\"\",VLOOKUP($K27,'E7'!$B$3:$G$22,5,FALSE))","v":""},{"$f":"IF(ISNA((VLOOKUP($K27,'E7'!$B$3:$G$22,6,FALSE))),\"\",IF(ISBLANK(VLOOKUP($K27,'E7'!$B$3:$G$22,6,FALSE)),\"\",VLOOKUP($K27,'E7'!$B$3:$G$22,6,FALSE)))","v":""},{"$f":"IF(ISNA(VLOOKUP($K27,'E8'!$B$3:$G$22,5,FALSE)),\"\",VLOOKUP($K27,'E8'!$B$3:$G$22,5,FALSE))","v":""},{"$f":"IF(ISNA((VLOOKUP($K27,'E8'!$B$3:$G$22,6,FALSE))),\"\",IF(ISBLANK(VLOOKUP($K27,'E8'!$B$3:$G$22,6,FALSE)),\"\",VLOOKUP($K27,'E8'!$B$3:$G$22,6,FALSE)))","v":""},{"$f":"IF(ISNA(VLOOKUP($K27,'E9'!$B$3:$G$22,5,FALSE)),\"\",VLOOKUP($K27,'E9'!$B$3:$G$22,5,FALSE))","v":""},{"$f":"IF(ISNA((VLOOKUP($K27,'E9'!$B$3:$G$22,6,FALSE))),\"\",IF(ISBLANK(VLOOKUP($K27,'E9'!$B$3:$G$22,6,FALSE)),\"\",VLOOKUP($K27,'E9'!$B$3:$G$22,6,FALSE)))","v":""},{"$f":"IF(ISNA(VLOOKUP($K27,'E10'!$B$3:$G$22,5,FALSE)),\"\",VLOOKUP($K27,'E10'!$B$3:$G$22,5,FALSE))","v":""},{"$f":"IF(ISNA((VLOOKUP($K27,'E10'!$B$3:$G$22,6,FALSE))),\"\",IF(ISBLANK(VLOOKUP($K27,'E10'!$B$3:$G$22,6,FALSE)),\"\",VLOOKUP($K27,'E10'!$B$3:$G$22,6,FALSE)))","v":""},{"$f":"IF(ISNA(VLOOKUP($K27,'E11'!$B$3:$G$22,5,FALSE)),\"\",VLOOKUP($K27,'E11'!$B$3:$G$22,5,FALSE))","v":""},{"$f":"IF(ISNA((VLOOKUP($K27,'E11'!$B$3:$G$22,6,FALSE))),\"\",IF(ISBLANK(VLOOKUP($K27,'E11'!$B$3:$G$22,6,FALSE)),\"\",VLOOKUP($K27,'E11'!$B$3:$G$22,6,FALSE)))","v":""},{"$f":"IF(ISNA(VLOOKUP($K27,'E12'!$B$3:$G$22,5,FALSE)),\"\",VLOOKUP($K27,'E12'!$B$3:$G$22,5,FALSE))","v":""},{"$f":"IF(ISNA((VLOOKUP($K27,'E12'!$B$3:$G$22,6,FALSE))),\"\",IF(ISBLANK(VLOOKUP($K27,'E12'!$B$3:$G$22,6,FALSE)),\"\",VLOOKUP($K27,'E12'!$B$3:$G$22,6,FALSE)))","v":""},{"$f":"IF(ISNA(VLOOKUP($K27,'E13'!$B$3:$G$22,5,FALSE)),\"\",VLOOKUP($K27,'E13'!$B$3:$G$22,5,FALSE))","v":""},{"$f":"IF(ISNA((VLOOKUP($K27,'E13'!$B$3:$G$22,6,FALSE))),\"\",IF(ISBLANK(VLOOKUP($K27,'E13'!$B$3:$G$22,6,FALSE)),\"\",VLOOKUP($K27,'E13'!$B$3:$G$22,6,FALSE)))","v":""},{"$f":"IF(ISNA(VLOOKUP($K27,'E14'!$B$3:$G$22,5,FALSE)),\"\",VLOOKUP($K27,'E14'!$B$3:$G$22,5,FALSE))","v":""},{"$f":"IF(ISNA((VLOOKUP($K27,'E14'!$B$3:$G$22,6,FALSE))),\"\",IF(ISBLANK(VLOOKUP($K27,'E14'!$B$3:$G$22,6,FALSE)),\"\",VLOOKUP($K27,'E14'!$B$3:$G$22,6,FALSE)))","v":""},{"$f":"IF(ISNA(VLOOKUP($K27,'E15'!$B$3:$G$22,5,FALSE)),\"\",VLOOKUP($K27,'E15'!$B$3:$G$22,5,FALSE))","v":""},{"$f":"IF(ISNA((VLOOKUP($K27,'E15'!$B$3:$G$22,6,FALSE))),\"\",IF(VLOOKUP($K27,'E15'!$B$3:$G$22,6,FALSE)=0,\"\",VLOOKUP($K27,'E15'!$B$3:$G$22,6,FALSE)))","v":""},{"$f":"IF(ISNA(VLOOKUP($K27,'E16'!$B$3:$G$22,5,FALSE)),\"\",VLOOKUP($K27,'E16'!$B$3:$G$22,5,FALSE))","v":""},{"$f":"IF(ISNA((VLOOKUP($K27,'E16'!$B$3:$G$22,6,FALSE))),\"\",IF(ISBLANK(VLOOKUP($K27,'E16'!$B$3:$G$22,6,FALSE)),\"\",VLOOKUP($K27,'E16'!$B$3:$G$22,6,FALSE)))","v":""},{"$f":"IF(ISNA(VLOOKUP($K27,'E17'!$B$3:$G$22,5,FALSE)),\"\",VLOOKUP($K27,'E17'!$B$3:$G$22,5,FALSE))","v":""},{"$f":"IF(ISNA((VLOOKUP($K27,'E17'!$B$3:$G$22,6,FALSE))),\"\",IF(ISBLANK(VLOOKUP($K27,'E17'!$B$3:$G$22,6,FALSE)),\"\",VLOOKUP($K27,'E17'!$B$3:$G$22,6,FALSE)))","v":""},{"$f":"IF(ISNA(VLOOKUP($K27,'E18'!$B$3:$G$22,5,FALSE)),\"\",VLOOKUP($K27,'E18'!$B$3:$G$22,5,FALSE))","v":""},{"$f":"IF(ISNA((VLOOKUP($K27,'E18'!$B$3:$G$22,6,FALSE))),\"\",IF(ISBLANK(VLOOKUP($K27,'E18'!$B$3:$G$22,6,FALSE)),\"\",VLOOKUP($K27,'E18'!$B$3:$G$22,6,FALSE)))","v":""},{"$f":"IF(ISNA(VLOOKUP($K27,'E19'!$B$3:$G$22,5,FALSE)),\"\",VLOOKUP($K27,'E19'!$B$3:$G$22,5,FALSE))","v":""},{"$f":"IF(ISNA((VLOOKUP($K27,'E19'!$B$3:$G$22,6,FALSE))),\"\",IF(ISBLANK(VLOOKUP($K27,'E19'!$B$3:$G$22,6,FALSE)),\"\",VLOOKUP($K27,'E19'!$B$3:$G$22,6,FALSE)))","v":""},{"$f":"IF(ISNA(VLOOKUP($K27,'E20'!$B$3:$G$22,5,FALSE)),\"\",VLOOKUP($K27,'E20'!$B$3:$G$22,5,FALSE))","v":""},{"$f":"IF(ISNA((VLOOKUP($K27,'E20'!$B$3:$G$22,6,FALSE))),\"\",IF(ISBLANK(VLOOKUP($K27,'E20'!$B$3:$G$22,6,FALSE)),\"\",VLOOKUP($K27,'E20'!$B$3:$G$22,6,FALSE)))","v":""},{"$f":"IF(ISNA(VLOOKUP($K27,'E21'!$B$3:$G$22,5,FALSE)),\"\",VLOOKUP($K27,'E21'!$B$3:$G$22,5,FALSE))","v":""},{"$f":"IF(ISNA((VLOOKUP($K27,'E21'!$B$3:$G$22,6,FALSE))),\"\",IF(ISBLANK(VLOOKUP($K27,'E21'!$B$3:$G$22,6,FALSE)),\"\",VLOOKUP($K27,'E21'!$B$3:$G$22,6,FALSE)))","v":""},{"$f":"IF(ISNA(VLOOKUP($K27,'E22'!$B$3:$G$22,5,FALSE)),\"\",VLOOKUP($K27,'E22'!$B$3:$G$22,5,FALSE))","v":""},{"$f":"IF(ISNA((VLOOKUP($K27,'E22'!$B$3:$G$22,6,FALSE))),\"\",IF(ISBLANK(VLOOKUP($K27,'E22'!$B$3:$G$22,6,FALSE)),\"\",VLOOKUP($K27,'E22'!$B$3:$G$22,6,FALSE)))","v":""},{"$f":"IF(ISNA(VLOOKUP($K27,'E23'!$B$3:$G$22,5,FALSE)),\"\",VLOOKUP($K27,'E23'!$B$3:$G$22,5,FALSE))","v":""},{"$f":"IF(ISNA((VLOOKUP($K27,'E23'!$B$3:$G$22,6,FALSE))),\"\",IF(ISBLANK(VLOOKUP($K27,'E23'!$B$3:$G$22,6,FALSE)),\"\",VLOOKUP($K27,'E23'!$B$3:$G$22,6,FALSE)))","v":""},{"$f":"IF(ISNA(VLOOKUP($K27,'E24'!$B$3:$G$22,5,FALSE)),\"\",VLOOKUP($K27,'E24'!$B$3:$G$22,5,FALSE))","v":""},{"$f":"IF(ISNA((VLOOKUP($K27,'E24'!$B$3:$G$22,6,FALSE))),\"\",IF(ISBLANK(VLOOKUP($K27,'E24'!$B$3:$G$22,6,FALSE)),\"\",VLOOKUP($K27,'E24'!$B$3:$G$22,6,FALSE)))","v":""},{"$f":"IF(ISNA(VLOOKUP($K27,'E25'!$B$3:$G$22,5,FALSE)),\"\",VLOOKUP($K27,'E25'!$B$3:$G$22,5,FALSE))","v":""},{"$f":"IF(ISNA((VLOOKUP($K27,'E25'!$B$3:$G$22,6,FALSE))),\"\",IF(ISBLANK(VLOOKUP($K27,'E25'!$B$3:$G$22,6,FALSE)),\"\",VLOOKUP($K27,'E25'!$B$3:$G$22,6,FALSE)))","v":""},{"$f":"IF(ISNA(VLOOKUP($K27,'E26'!$B$3:$G$22,5,FALSE)),\"\",VLOOKUP($K27,'E26'!$B$3:$G$22,5,FALSE))","v":""},{"$f":"IF(ISNA((VLOOKUP($K27,'E26'!$B$3:$G$22,6,FALSE))),\"\",IF(ISBLANK(VLOOKUP($K27,'E26'!$B$3:$G$22,6,FALSE)),\"\",VLOOKUP($K27,'E26'!$B$3:$G$22,6,FALSE)))","v":""},{"$f":"IF(ISNA(VLOOKUP($K27,'E27'!$B$3:$G$22,5,FALSE)),\"\",VLOOKUP($K27,'E27'!$B$3:$G$22,5,FALSE))","v":""},{"$f":"IF(ISNA((VLOOKUP($K27,'E27'!$B$3:$G$22,6,FALSE))),\"\",IF(ISBLANK(VLOOKUP($K27,'E27'!$B$3:$G$22,6,FALSE)),\"\",VLOOKUP($K27,'E27'!$B$3:$G$22,6,FALSE)))","v":""},{"$f":"IF(ISNA(VLOOKUP($K27,'E28'!$B$3:$G$22,5,FALSE)),\"\",VLOOKUP($K27,'E28'!$B$3:$G$22,5,FALSE))","v":""},{"$f":"IF(ISNA((VLOOKUP($K27,'E28'!$B$3:$G$22,6,FALSE))),\"\",IF(ISBLANK(VLOOKUP($K27,'E28'!$B$3:$G$22,6,FALSE)),\"\",VLOOKUP($K27,'E28'!$B$3:$G$22,6,FALSE)))","v":""},{"$f":"IF(ISNA(VLOOKUP($K27,'E29'!$B$3:$G$22,5,FALSE)),\"\",VLOOKUP($K27,'E29'!$B$3:$G$22,5,FALSE))","v":""},{"$f":"IF(ISNA((VLOOKUP($K27,'E29'!$B$3:$G$22,6,FALSE))),\"\",IF(ISBLANK(VLOOKUP($K27,'E29'!$B$3:$G$22,6,FALSE)),\"\",VLOOKUP($K27,'E29'!$B$3:$G$22,6,FALSE)))","v":""},{"$f":"IF(ISNA(VLOOKUP($K27,'E30'!$B$3:$G$22,5,FALSE)),\"\",VLOOKUP($K27,'E30'!$B$3:$G$22,5,FALSE))","v":""},{"$f":"IF(ISNA((VLOOKUP($K27,'E30'!$B$3:$G$22,6,FALSE))),\"\",IF(ISBLANK(VLOOKUP($K27,'E30'!$B$3:$G$22,6,FALSE)),\"\",VLOOKUP($K27,'E30'!$B$3:$G$22,6,FALSE)))","v":""}]
["E24",{"$f":"CONCATENATE('Liste classe'!E26,\" \",'Liste classe'!F26,\" \",'Liste classe'!G26,\" \",'Liste classe'!H26,\" \",'Liste classe'!I26,\" \",'Liste classe'!J26)","v":"     "},{"$f":"'E24'!$F$24","v":"00:00:00"},{"$f":"'E24'!$F$26","v":" "},{"$f":"'E24'!$G$28","v":0},{"$f":"'E24'!$I$28","v":0},{"$f":"COUNTA('E24'!$D$3:$D$22)","v":0}]
["E25",{"$f":"CONCATENATE('Liste classe'!E27,\" \",'Liste classe'!F27,\" \",'Liste classe'!G27,\" \",'Liste classe'!H27,\" \",'Liste classe'!I27,\" \",'Liste classe'!J27)","v":"     "},{"$f":"'E25'!$F$24","v":"00:00:00"},{"$f":"'E25'!$F$26","v":" "},{"$f":"'E25'!$G$28","v":0},{"$f":"'E25'!$I$28","v":0},{"$f":"COUNTA('E25'!$D$3:$D$22)","v":0}]
["E26",{"$f":"CONCATENATE('Liste classe'!E28,\" \",'Liste classe'!F28,\" \",'Liste classe'!G28,\" \",'Liste classe'!H28,\" \",'Liste classe'!I28,\" \",'Liste classe'!J28)","v":"     "},{"$f":"'E26'!$F$24","v":"00:00:00"},{"$f":"'E26'!$F$26","v":" "},{"$f":"'E26'!$G$28","v":0},{"$f":"'E26'!$I$28","v":0},{"$f":"COUNTA('E26'!$D$3:$D$22)","v":0}]
["E27",{"$f":"CONCATENATE('Liste classe'!E29,\" \",'Liste classe'!F29,\" \",'Liste classe'!G29,\" \",'Liste classe'!H29,\" \",'Liste classe'!I29,\" \",'Liste classe'!J29)","v":"     "},{"$f":"'E27'!$F$24","v":"00:00:00"},{"$f":"'E27'!$F$26","v":" "},{"$f":"'E27'!$G$28","v":0},{"$f":"'E27'!$I$28","v":0},{"$f":"COUNTA('E27'!$D$3:$D$22)","v":0}]
["E28",{"$f":"CONCATENATE('Liste classe'!E30,\" \",'Liste classe'!F30,\" \",'Liste classe'!G30,\" \",'Liste classe'!H30,\" \",'Liste classe'!I30,\" \",'Liste classe'!J30)","v":"     "},{"$f":"'E28'!$F$24","v":"00:00:00"},{"$f":"'E28'!$F$26","v":" "},{"$f":"'E28'!$G$28","v":0},{"$f":"'E28'!$I$28","v":0},{"$f":"COUNTA('E28'!$D$3:$D$22)","v":0}]
["E29",{"$f":"CONCATENATE('Liste classe'!E31,\" \",'Liste classe'!F31,\" \",'Liste classe'!G31,\" \",'Liste classe'!H31,\" \",'Liste classe'!I31,\" \",'Liste classe'!J31)","v":"     "},{"$f":"'E29'!$F$24","v":"00:00:00"},{"$f":"'E29'!$F$26","v":" "},{"$f":"'E29'!$G$28","v":0},{"$f":"'E29'!$I$28","v":0},{"$f":"COUNTA('E29'!$D$3:$D$22)","v":0}]
["E30",{"$f":"CONCATENATE('Liste classe'!E32,\" \",'Liste classe'!F32,\" \",'Liste classe'!G32,\" \",'Liste classe'!H32,\" \",'Liste classe'!I32,\" \",'Liste classe'!J32)","v":"     "},{"$f":"'E30'!$F$24","v":"00:00:00"},{"$f":"'E30'!$F$26","v":" "},{"$f":"'E30'!$G$28","v":0},{"$f":"'E30'!$I$28","v":0},{"$f":"COUNTA('E30'!$D$3:$D$22)","v":0}]

{"sheet":"Présentation","index":4,"n_rows":0,"n_cols":0,"rows_kept":0,"cut":false,"hidden":false,"merged":[]}

{"sheet":"E1","index":5,"n_rows":30,"n_cols":17,"rows_kept":30,"cut":false,"hidden":false,"merged":[]}
[null,null,null,"EQUIPE ",1,null," ",null," ",{"$f":"NOW()","v":43688.614419444442}]
[null,"BALISES","NB","DEPART","ARRIVEE","TEMPS","NB Trouvées"]
["Circuit 1",{"$f":"IF(ISBLANK(Circuits!D3),\" \",(Circuits!D3))","v":" "},{"$f":"IF(ISBLANK(Circuits!E3),\" \",(Circuits!E3))","v":" "},null,null,{"$f":"IF(ISBLANK(E3),\" \",E3-D3)","v":" "},null,"SUR",{"$f":"IF(ISBLANK(D3),\" \",C3)","v":" "},null,null,null,null,null,null,null,{"$f":"IF(COUNTA(D3)=COUNTA(E3),\"\",B3)","v":""}]
["Circuit 2",{"$f":"IF(ISBLANK(Circuits!D4),\" \",(Circuits!D4))","v":" "},{"$f":"IF(ISBLANK(Circuits!E4),\" \",(Circuits!E4))","v":" "},null,null," ",null,"SUR",{"$f":"IF(ISBLANK(D4),\" \",C4)","v":" "},null,null,null,null,null,null,null,{"$f":"IF(COUNTA(D4)=COUNTA(E4),\"\",B4)","v":""}]
["Circuit 3",{"$f":"IF(ISBLANK(Circuits!D5),\" \",(Circuits!D5))","v":" "},{"$f":"IF(ISBLANK(Circuits!E5),\" \",(Circuits!E5))","v":" "},null,null," ",null,"SUR"," ",null,null,null,null,null,{"$f":"IF(ISBLANK('Liste classe'!E3),\" \",('Liste classe'!E3))","v":" "},null,""]
["Circuit 4",{"$f":"IF(ISBLANK(Circuits!D6),\" \",(Circuits!D6))","v":" "},{"$f":"IF(ISBLANK(Circuits!E6),\" \",(Circuits!E6))","v":" "},null,null," ",null,"SUR"," ",null,null,null,null,null,{"$f":"IF(ISBLANK('Liste classe'!F3),\" \",('Liste classe'!F3))","v":" "},null,""]
["Circuit 5",{"$f":"IF(ISBLANK(Circuits!D7),\" \",(Circuits!D7))","v":" "},{"$f":"IF(ISBLANK(Circuits!E7),\" \",(Circuits!E7))","v":" "},null,null," ",null,"SUR"," ",null,null,null,null,null,{"$f":"IF(ISBLANK('Liste classe'!G3),\" \",('Liste classe'!G3))","v":" "},null,""]
["Circuit 6",{"$f":"IF(ISBLANK(Circuits!D8),\" \",(Circuits!D8))","v":" "},{"$f":"IF(ISBLANK(Circuits!E8),\" \",(Circuits!E8))","v":" "},null,null," ",null,"SUR"," ",null,null,null,null,null,{"$f":"IF(ISBLANK('Liste classe'!H3),\" \",('Liste classe'!H3))","v":" "},null,""]
["Circuit 7",{"$f":"IF(ISBLANK(Circuits!D9),\" \",(Circuits!D9))","v":" "},{"$f":"IF(ISBLANK(Circuits!E9),\" \",(Circuits!E9))","v":" "},null,null," ",null,"SUR"," ",null,null,null,null,null,{"$f":"IF(ISBLANK('Liste classe'!I3),\" \",('Liste classe'!I3))","v":" "},null,""]
["Circuit 8",{"$f":"IF(ISBLANK(Circuits!D10),\" \",(Circuits!D10))","v":" "},{"$f":"IF(ISBLANK(Circuits!E10),\" \",(Circuits!E10))","v":" "},null,null," ",null,"SUR"," ",null,null,null,null,null,{"$f":"IF(ISBLANK('Liste classe'!J3),\" \",('Liste classe'!J3))","v":" "},null,""]
["Circuit 9",{"$f":"IF(ISBLANK(Circuits!D11),\" \",(Circuits!D11))","v":" "},{"$f":"IF(ISBLANK(Circuits!E11),\" \",(Circuits!E11))","v":" "},null,null," ",null,"SUR"," ",null,null,null,null,null,null,null,""]
["Circuit 10",{"$f":"IF(ISBLANK(Circuits!D12),\" \",(Circuits!D12))","v":" "},{"$f":"IF(ISBLANK(Circuits!E12),\" \",(Circuits!E12))","v":" "},null,null," ",null,"SUR"," ",null,null,null,null,null,null,null,""]
["Circuit 11",{"$f":"IF(ISBLANK(Circuits!D13),\" \",(Circuits!D13))","v":" "},{"$f":"IF(ISBLANK(Circuits!E13),\" \",(Circuits!E13))","v":" "},null,null," ",null,"SUR"," ",null,null,null,null,null,null,null,""]
["Circuit 12",{"$f":"IF(ISBLANK(Circuits!D14),\" \",(Circuits!D14))","v":" "},{"$f":"IF(ISBLANK(Circuits!E14),\" \",(Circuits!E14))","v":" "},null,null," ",null,"SUR"," ",null,null,null,null,null,null,null,""]
["Circuit 13",{"$f":"IF(ISBLANK(Circuits!D15),\" \",(Circuits!D15))","v":" "},{"$f":"IF(ISBLANK(Circuits!E15),\" \",(Circuits!E15))","v":" "},null,null," ",null,"SUR"," ",null,null,null,null,null,null,null,""]
["Circuit 14",{"$f":"IF(ISBLANK(Circuits!D16),\" \",(Circuits!D16))","v":" "},{"$f":"IF(ISBLANK(Circuits!E16),\" \",(Circuits!E16))","v":" "},null,null," ",null,"SUR"," ",null,null,null,null,null,null,null,""]
["Circuit 15",{"$f":"IF(ISBLANK(Circuits!D17),\" \",(Circuits!D17))","v":" "},{"$f":"IF(ISBLANK(Circuits!E17),\" \",(Circuits!E17))","v":" "},null,null," ",null,"SUR"," ",null,null,null,null,null,null,null,""]
["Circuit 16",{"$f":"IF(ISBLANK(Circuits!D18),\" \",(Circuits!D18))","v":" "},{"$f":"IF(ISBLANK(Circuits!E18),\" \",(Circuits!E18))","v":" "},null,null," ",null,"SUR"," ",null,null,null,null,null,null,null,""]
["Circuit 17",{"$f":"IF(ISBLANK(Circuits!D19),\" \",(Circuits!D19))","v":" "},{"$f":"IF(ISBLANK(Circuits!E19),\" \",(Circuits!E19))","v":" "},null,null," ",null,"SUR"," ",null,null,null,null,null,null,null,""]
["Circuit 18",{"$f":"IF(ISBLANK(Circuits!D20),\" \",(Circuits!D20))","v":" "},{"$f":"IF(ISBLANK(Circuits!E20),\" \",(Circuits!E20))","v":" "},null,null," ",null,"SUR"," ",null,null,null,null,null,null,null,""]
["Circuit 19",{"$f":"IF(ISBLANK(Circuits!D21),\" \",(Circuits!D21))","v":" "},{"$f":"IF(ISBLANK(Circuits!E21),\" \",(Circuits!E21))","v":" "},null,null," ",null,"SUR"," ",null,null,null,null,null,null,null,""]
["Circuit 20",{"$f":"IF(ISBLANK(Circuits!D22),\" \",(Circuits!D22))","v":" "},{"$f":"IF(ISBLANK(Circuits!E22),\" \",(Circuits!E22))","v":" "},null,null," ",null,"SUR"," ",null,null,null,null,null,null,null,""]
[null,null,null,null,null,null,null,null,null,null,null,null,null,null,null,null,{"$f":"CONCATENATE(Q3,Q4,Q5,Q6,Q7,Q8,Q9,Q10,Q11,Q12,Q13,Q14,Q15,Q16,Q17,Q18,Q19,Q20,Q21,Q22)","v":""}]
[null,null,null,"TEMPS TOTAL",null,{"$f":"SUM(F3:F22)","v":"00:00:00"}]
[]
[null,null,null,"TEMPS MOYEN",null,{"$f":"IF(ISBLANK(D3),\" \",AVERAGE(F3:F22))","v":" "}]
[]
[null,null,null,"NB TOTAL BALISES",null,null,{"$f":"SUM(G3:G22)","v":0},"SUR",{"$f":"SUM(I3:I22)","v":0}]
[]
[null,null,null,{"$f":"COUNTA(D3:D22)","v":0},{"$f":"COUNTA(E3:E22)","v":0}]

{"sheet":"E2","index":6,"n_rows":30,"n_cols":17,"rows_kept":30,"cut":false,"hidden":false,"merged":[]}
[null,null,null,"EQUIPE ",2,null," ",null," ",{"$f":"NOW()","v":43688.614419444442}]
[null,"BALISES","NB","DEPART","ARRIVEE","TEMPS","NB Trouvées"]
["Circuit 1",{"$f":"IF(ISBLANK(Circuits!F3),\" \",(Circuits!F3))","v":" "},{"$f":"IF(ISBLANK(Circuits!G3),\" \",(Circuits!G3))","v":" "},null,null,{"$f":"IF(ISBLANK(E3),\" \",E3-D3)","v":" "},null,"SUR",{"$f":"IF(ISBLANK(D3),\" \",C3)","v":" "},null,null,null,null,null,null,null,{"$f":"IF(COUNTA(D3)=COUNTA(E3),\"\",B3)","v":""}]
["Circuit 2",{"$f":"IF(ISBLANK(Circuits!F4),\" \",(Circuits!F4))","v":" "},{"$f":"IF(ISBLANK(Circuits!G4),\" \",(Circuits!G4))","v":" "},null,null," ",null,"SUR",{"$f":"IF(ISBLANK(D4),\" \",C4)","v":" "},null,null,null,null,null,null,null,{"$f":"IF(COUNTA(D4)=COUNTA(E4),\"\",B4)","v":""}]
["Circuit 3",{"$f":"IF(ISBLANK(Circuits!F5),\" \",(Circuits!F5))","v":" "},{"$f":"IF(ISBLANK(Circuits!G5),\" \",(Circuits!G5))","v":" "},null,null," ",null,"SUR"," ",null,null,null,null,null,{"$f":"IF(ISBLANK('Liste classe'!E4),\" \",('Liste classe'!E4))","v":" "},null,""]
["Circuit 4",{"$f":"IF(ISBLANK(Circuits!F6),\" \",(Circuits!F6))","v":" "},{"$f":"IF(ISBLANK(Circuits!G6),\" \",(Circuits!G6))","v":" "},null,null," ",null,"SUR"," ",null,null,null,null,null,{"$f":"IF(ISBLANK('Liste classe'!F4),\" \",('Liste classe'!F4))","v":" "},null,""]
["Circuit 5",{"$f":"IF(ISBLANK(Circuits!F7),\" \",(Circuits!F7))","v":" "},{"$f":"IF(ISBLANK(Circuits!G7),\" \",(Circuits!G7))","v":" "},null,null," ",null,"SUR"," ",null,null,null,null,null,{"$f":"IF(ISBLANK('Liste classe'!G4),\" \",('Liste classe'!G4))","v":" "},null,""]
["Circuit 6",{"$f":"IF(ISBLANK(Circuits!F8),\" \",(Circuits!F8))","v":" "},{"$f":"IF(ISBLANK(Circuits!G8),\" \",(Circuits!G8))","v":" "},null,null," ",null,"SUR"," ",null,null,null,null,null,{"$f":"IF(ISBLANK('Liste classe'!H4),\" \",('Liste classe'!H4))","v":" "},null,""]
["Circuit 7",{"$f":"IF(ISBLANK(Circuits!F9),\" \",(Circuits!F9))","v":" "},{"$f":"IF(ISBLANK(Circuits!G9),\" \",(Circuits!G9))","v":" "},null,null," ",null,"SUR"," ",null,null,null,null,null,{"$f":"IF(ISBLANK('Liste classe'!I4),\" \",('Liste classe'!I4))","v":" "},null,""]
["Circuit 8",{"$f":"IF(ISBLANK(Circuits!F10),\" \",(Circuits!F10))","v":" "},{"$f":"IF(ISBLANK(Circuits!G10),\" \",(Circuits!G10))","v":" "},null,null," ",null,"SUR"," ",null,null,null,null,null,{"$f":"IF(ISBLANK('Liste classe'!J4),\" \",('Liste classe'!J4))","v":" "},null,""]
["Circuit 9",{"$f":"IF(ISBLANK(Circuits!F11),\" \",(Circuits!F11))","v":" "},{"$f":"IF(ISBLANK(Circuits!G11),\" \",(Circuits!G11))","v":" "},null,null," ",null,"SUR"," ",null,null,null,null,null,null,null,""]
["Circuit 10",{"$f":"IF(ISBLANK(Circuits!F12),\" \",(Circuits!F12))","v":" "},{"$f":"IF(ISBLANK(Circuits!G12),\" \",(Circuits!G12))","v":" "},null,null," ",null,"SUR"," ",null,null,null,null,null,null,null,""]
["Circuit 11",{"$f":"IF(ISBLANK(Circuits!F13),\" \",(Circuits!F13))","v":" "},{"$f":"IF(ISBLANK(Circuits!G13),\" \",(Circuits!G13))","v":" "},null,null," ",null,"SUR"," ",null,null,null,null,null,null,null,""]
["Circuit 12",{"$f":"IF(ISBLANK(Circuits!F14),\" \",(Circuits!F14))","v":" "},{"$f":"IF(ISBLANK(Circuits!G14),\" \",(Circuits!G14))","v":" "},null,null," ",null,"SUR"," ",null,null,null,null,null,null,null,""]
["Circuit 13",{"$f":"IF(ISBLANK(Circuits!F15),\" \",(Circuits!F15))","v":" "},{"$f":"IF(ISBLANK(Circuits!G15),\" \",(Circuits!G15))","v":" "},null,null," ",null,"SUR"," ",null,null,null,null,null,null,null,""]
["Circuit 14",{"$f":"IF(ISBLANK(Circuits!F16),\" \",(Circuits!F16))","v":" "},{"$f":"IF(ISBLANK(Circuits!G16),\" \",(Circuits!G16))","v":" "},null,null," ",null,"SUR"," ",null,null,null,null,null,null,null,""]
["Circuit 15",{"$f":"IF(ISBLANK(Circuits!F17),\" \",(Circuits!F17))","v":" "},{"$f":"IF(ISBLANK(Circuits!G17),\" \",(Circuits!G17))","v":" "},null,null," ",null,"SUR"," ",null,null,null,null,null,null,null,""]
["Circuit 16",{"$f":"IF(ISBLANK(Circuits!F18),\" \",(Circuits!F18))","v":" "},{"$f":"IF(ISBLANK(Circuits!G18),\" \",(Circuits!G18))","v":" "},null,null," ",null,"SUR"," ",null,null,null,null,null,null,null,""]
["Circuit 17",{"$f":"IF(ISBLANK(Circuits!F19),\" \",(Circuits!F19))","v":" "},{"$f":"IF(ISBLANK(Circuits!G19),\" \",(Circuits!G19))","v":" "},null,null," ",null,"SUR"," ",null,null,null,null,null,null,null,""]
["Circuit 18",{"$f":"IF(ISBLANK(Circuits!F20),\" \",(Circuits!F20))","v":" "},{"$f":"IF(ISBLANK(Circuits!G20),\" \",(Circuits!G20))","v":" "},null,null," ",null,"SUR"," ",null,null,null,null,null,null,null,""]
["Circuit 19",{"$f":"IF(ISBLANK(Circuits!F21),\" \",(Circuits!F21))","v":" "},{"$f":"IF(ISBLANK(Circuits!G21),\" \",(Circuits!G21))","v":" "},null,null," ",null,"SUR"," ",null,null,null,null,null,null,null,""]
["Circuit 20",{"$f":"IF(ISBLANK(Circuits!F22),\" \",(Circuits!F22))","v":" "},{"$f":"IF(ISBLANK(Circuits!G22),\" \",(Circuits!G22))","v":" "},null,null," ",null,"SUR"," ",null,null,null,null,null,null,null,""]
[null,null,null,null,null,null,null,null,null,null,null,null,null,null,null,null,{"$f":"CONCATENATE(Q3,Q4,Q5,Q6,Q7,Q8,Q9,Q10,Q11,Q12,Q13,Q14,Q15,Q16,Q17,Q18,Q19,Q20,Q21,Q22)","v":""}]
[null,null,null,"TEMPS TOTAL",null,{"$f":"SUM(F3:F22)","v":"00:00:00"}]
[]
[null,null,null,"TEMPS MOYEN",null,{"$f":"IF(ISBLANK(D3),\" \",AVERAGE(F3:F22))","v":" "}]
[]
[null,null,null,"NB TOTAL BALISES",null,null,{"$f":"SUM(G3:G22)","v":0},"SUR",{"$f":"SUM(I3:I22)","v":0}]
[]
[null,null,null,{"$f":"COUNTA(D3:D22)","v":0},{"$f":"COUNTA(E3:E22)","v":0}]

{"sheet":"E3","index":7,"n_rows":30,"n_cols":17,"rows_kept":30,"cut":false,"hidden":false,"merged":[]}
[null,null,null,"EQUIPE ",3,null," ",null," ",{"$f":"NOW()","v":43688.614419444442}]
[null,"BALISES","NB","DEPART","ARRIVEE","TEMPS","NB Trouvées"]
["Circuit 1",{"$f":"IF(ISBLANK(Circuits!H3),\" \",(Circuits!H3))","v":" "},{"$f":"IF(ISBLANK(Circuits!I3),\" \",(Circuits!I3))","v":" "},null,null,{"$f":"IF(ISBLANK(E3),\" \",E3-D3)","v":" "},null,"SUR",{"$f":"IF(ISBLANK(D3),\" \",C3)","v":" "},null,null,null,null,null,null,null,{"$f":"IF(COUNTA(D3)=COUNTA(E3),\"\",B3)","v":""}]
["Circuit 2",{"$f":"IF(ISBLANK(Circuits!H4),\" \",(Circuits!H4))","v":" "},{"$f":"IF(ISBLANK(Circuits!I4),\" \",(Circuits!I4))","v":" "},null,null," ",null,"SUR",{"$f":"IF(ISBLANK(D4),\" \",C4)","v":" "},null,null,null,null,null,null,null,{"$f":"IF(COUNTA(D4)=COUNTA(E4),\"\",B4)","v":""}]
["Circuit 3",{"$f":"IF(ISBLANK(Circuits!H5),\" \",(Circuits!H5))","v":" "},{"$f":"IF(ISBLANK(Circuits!I5),\" \",(Circuits!I5))","v":" "},null,null," ",null,"SUR"," ",null,null,null,null,null,{"$f":"IF(ISBLANK('Liste classe'!E5),\" \",('Liste classe'!E5))","v":" "},null,""]
["Circuit 4",{"$f":"IF(ISBLANK(Circuits!H6),\" \",(Circuits!H6))","v":" "},{"$f":"IF(ISBLANK(Circuits!I6),\" \",(Circuits!I6))","v":" "},null,null," ",null,"SUR"," ",null,null,null,null,null,{"$f":"IF(ISBLANK('Liste classe'!F5),\" \",('Liste classe'!F5))","v":" "},null,""]
["Circuit 5",{"$f":"IF(ISBLANK(Circuits!H7),\" \",(Circuits!H7))","v":" "},{"$f":"IF(ISBLANK(Circuits!I7),\" \",(Circuits!I7))","v":" "},null,null," ",null,"SUR"," ",null,null,null,null,null,{"$f":"IF(ISBLANK('Liste classe'!G5),\" \",('Liste classe'!G5))","v":" "},null,""]
["Circuit 6",{"$f":"IF(ISBLANK(Circuits!H8),\" \",(Circuits!H8))","v":" "},{"$f":"IF(ISBLANK(Circuits!I8),\" \",(Circuits!I8))","v":" "},null,null," ",null,"SUR"," ",null,null,null,null,null,{"$f":"IF(ISBLANK('Liste classe'!H5),\" \",('Liste classe'!H5))","v":" "},null,""]
["Circuit 7",{"$f":"IF(ISBLANK(Circuits!H9),\" \",(Circuits!H9))","v":" "},{"$f":"IF(ISBLANK(Circuits!I9),\" \",(Circuits!I9))","v":" "},null,null," ",null,"SUR"," ",null,null,null,null,null,{"$f":"IF(ISBLANK('Liste classe'!I5),\" \",('Liste classe'!I5))","v":" "},null,""]
["Circuit 8",{"$f":"IF(ISBLANK(Circuits!H10),\" \",(Circuits!H10))","v":" "},{"$f":"IF(ISBLANK(Circuits!I10),\" \",(Circuits!I10))","v":" "},null,null," ",null,"SUR"," ",null,null,null,null,null,{"$f":"IF(ISBLANK('Liste classe'!J5),\" \",('Liste classe'!J5))","v":" "},null,""]
["Circuit 9",{"$f":"IF(ISBLANK(Circuits!H11),\" \",(Circuits!H11))","v":" "},{"$f":"IF(ISBLANK(Circuits!I11),\" \",(Circuits!I11))","v":" "},null,null," ",null,"SUR"," ",null,null,null,null,null,null,null,""]
["Circuit 10",{"$f":"IF(ISBLANK(Circuits!H12),\" \",(Circuits!H12))","v":" "},{"$f":"IF(ISBLANK(Circuits!I12),\" \",(Circuits!I12))","v":" "},null,null," ",null,"SUR"," ",null,null,null,null,null,null,null,""]
["Circuit 11",{"$f":"IF(ISBLANK(Circuits!H13),\" \",(Circuits!H13))","v":" "},{"$f":"IF(ISBLANK(Circuits!I13),\" \",(Circuits!I13))","v":" "},null,null," ",null,"SUR"," ",null,null,null,null,null,null,null,""]
["Circuit 12",{"$f":"IF(ISBLANK(Circuits!H14),\" \",(Circuits!H14))","v":" "},{"$f":"IF(ISBLANK(Circuits!I14),\" \",(Circuits!I14))","v":" "},null,null," ",null,"SUR"," ",null,null,null,null,null,null,null,""]
["Circuit 13",{"$f":"IF(ISBLANK(Circuits!H15),\" \",(Circuits!H15))","v":" "},{"$f":"IF(ISBLANK(Circuits!I15),\" \",(Circuits!I15))","v":" "},null,null," ",null,"SUR"," ",null,null,null,null,null,null,null,""]
["Circuit 14",{"$f":"IF(ISBLANK(Circuits!H16),\" \",(Circuits!H16))","v":" "},{"$f":"IF(ISBLANK(Circuits!I16),\" \",(Circuits!I16))","v":" "},null,null," ",null,"SUR"," ",null,null,null,null,null,null,null,""]
["Circuit 15",{"$f":"IF(ISBLANK(Circuits!H17),\" \",(Circuits!H17))","v":" "},{"$f":"IF(ISBLANK(Circuits!I17),\" \",(Circuits!I17))","v":" "},null,null," ",null,"SUR"," ",null,null,null,null,null,null,null,""]
["Circuit 16",{"$f":"IF(ISBLANK(Circuits!H18),\" \",(Circuits!H18))","v":" "},{"$f":"IF(ISBLANK(Circuits!I18),\" \",(Circuits!I18))","v":" "},null,null," ",null,"SUR"," ",null,null,null,null,null,null,null,""]
["Circuit 17",{"$f":"IF(ISBLANK(Circuits!H19),\" \",(Circuits!H19))","v":" "},{"$f":"IF(ISBLANK(Circuits!I19),\" \",(Circuits!I19))","v":" "},null,null," ",null,"SUR"," ",null,null,null,null,null,null,null,""]
["Circuit 18",{"$f":"IF(ISBLANK(Circuits!H20),\" \",(Circuits!H20))","v":" "},{"$f":"IF(ISBLANK(Circuits!I20),\" \",(Circuits!I20))","v":" "},null,null," ",null,"SUR"," ",null,null,null,null,null,null,null,""]
["Circuit 19",{"$f":"IF(ISBLANK(Circuits!H21),\" \",(Circuits!H21))","v":" "},{"$f":"IF(ISBLANK(Circuits!I21),\" \",(Circuits!I21))","v":" "},null,null," ",null,"SUR"," ",null,null,null,null,null,null,null,""]
["Circuit 20",{"$f":"IF(ISBLANK(Circuits!H22),\" \",(Circuits!H22))","v":" "},{"$f":"IF(ISBLANK(Circuits!I22),\" \",(Circuits!I22))","v":" "},null,null," ",null,"SUR"," ",null,null,null,null,null,null,null,""]
[null,null,null,null,null,null,null,null,null,null,null,null,null,null,null,null,{"$f":"CONCATENATE(Q3,Q4,Q5,Q6,Q7,Q8,Q9,Q10,Q11,Q12,Q13,Q14,Q15,Q16,Q17,Q18,Q19,Q20,Q21,Q22)","v":""}]
[null,null,null,"TEMPS TOTAL",null,{"$f":"SUM(F3:F22)","v":"00:00:00"}]
[]
[null,null,null,"TEMPS MOYEN",null,{"$f":"IF(ISBLANK(D3),\" \",AVERAGE(F3:F22))","v":" "}]
[]
[null,null,null,"NB TOTAL BALISES",null,null,{"$f":"SUM(G3:G22)","v":0},"SUR",{"$f":"SUM(I3:I22)","v":0}]
[]
[null,null,null,{"$f":"COUNTA(D3:D22)","v":0},{"$f":"COUNTA(E3:E22)","v":0}]

{"sheet":"E4","index":8,"n_rows":30,"n_cols":17,"rows_kept":30,"cut":false,"hidden":false,"merged":[]}
[null,null,null,"EQUIPE ",4,null," ",null," ",{"$f":"NOW()","v":43688.614419444442}]
[null,"BALISES","NB","DEPART","ARRIVEE","TEMPS","NB Trouvées"]
["Circuit 1",{"$f":"IF(ISBLANK(Circuits!J3),\" \",(Circuits!J3))","v":" "},{"$f":"IF(ISBLANK(Circuits!K3),\" \",(Circuits!K3))","v":" "},null,null,{"$f":"IF(ISBLANK(E3),\" \",E3-D3)","v":" "},null,"SUR",{"$f":"IF(ISBLANK(D3),\" \",C3)","v":" "},null,null,null,null,null,null,null,{"$f":"IF(COUNTA(D3)=COUNTA(E3),\"\",B3)","v":""}]
["Circuit 2",{"$f":"IF(ISBLANK(Circuits!J4),\" \",(Circuits!J4))","v":" "},{"$f":"IF(ISBLANK(Circuits!K4),\" \",(Circuits!K4))","v":" "},null,null," ",null,"SUR",{"$f":"IF(ISBLANK(D4),\" \",C4)","v":" "},null,null,null,null,null,null,null,{"$f":"IF(COUNTA(D4)=COUNTA(E4),\"\",B4)","v":""}]
["Circuit 3",{"$f":"IF(ISBLANK(Circuits!J5),\" \",(Circuits!J5))","v":" "},{"$f":"IF(ISBLANK(Circuits!K5),\" \",(Circuits!K5))","v":" "},null,null," ",null,"SUR"," ",null,null,null,null,null,{"$f":"IF(ISBLANK('Liste classe'!E6),\" \",('Liste classe'!E6))","v":" "},null,""]
["Circuit 4",{"$f":"IF(ISBLANK(Circuits!J6),\" \",(Circuits!J6))","v":" "},{"$f":"IF(ISBLANK(Circuits!K6),\" \",(Circuits!K6))","v":" "},null,null," ",null,"SUR"," ",null,null,null,null,null,{"$f":"IF(ISBLANK('Liste classe'!F6),\" \",('Liste classe'!F6))","v":" "},null,""]
["Circuit 5",{"$f":"IF(ISBLANK(Circuits!J7),\" \",(Circuits!J7))","v":" "},{"$f":"IF(ISBLANK(Circuits!K7),\" \",(Circuits!K7))","v":" "},null,null," ",null,"SUR"," ",null,null,null,null,null,{"$f":"IF(ISBLANK('Liste classe'!G6),\" \",('Liste classe'!G6))","v":" "},null,""]
["Circuit 6",{"$f":"IF(ISBLANK(Circuits!J8),\" \",(Circuits!J8))","v":" "},{"$f":"IF(ISBLANK(Circuits!K8),\" \",(Circuits!K8))","v":" "},null,null," ",null,"SUR"," ",null,null,null,null,null,{"$f":"IF(ISBLANK('Liste classe'!H6),\" \",('Liste classe'!H6))","v":" "},null,""]
["Circuit 7",{"$f":"IF(ISBLANK(Circuits!J9),\" \",(Circuits!J9))","v":" "},{"$f":"IF(ISBLANK(Circuits!K9),\" \",(Circuits!K9))","v":" "},null,null," ",null,"SUR"," ",null,null,null,null,null,{"$f":"IF(ISBLANK('Liste classe'!I6),\" \",('Liste classe'!I6))","v":" "},null,""]
["Circuit 8",{"$f":"IF(ISBLANK(Circuits!J10),\" \",(Circuits!J10))","v":" "},{"$f":"IF(ISBLANK(Circuits!K10),\" \",(Circuits!K10))","v":" "},null,null," ",null,"SUR"," ",null,null,null,null,null,{"$f":"IF(ISBLANK('Liste classe'!J6),\" \",('Liste classe'!J6))","v":" "},null,""]
["Circuit 9",{"$f":"IF(ISBLANK(Circuits!J11),\" \",(Circuits!J11))","v":" "},{"$f":"IF(ISBLANK(Circuits!K11),\" \",(Circuits!K11))","v":" "},null,null," ",null,"SUR"," ",null,null,null,null,null,null,null,""]
["Circuit 10",{"$f":"IF(ISBLANK(Circuits!J12),\" \",(Circuits!J12))","v":" "},{"$f":"IF(ISBLANK(Circuits!K12),\" \",(Circuits!K12))","v":" "},null,null," ",null,"SUR"," ",null,null,null,null,null,null,null,""]
["Circuit 11",{"$f":"IF(ISBLANK(Circuits!J13),\" \",(Circuits!J13))","v":" "},{"$f":"IF(ISBLANK(Circuits!K13),\" \",(Circuits!K13))","v":" "},null,null," ",null,"SUR"," ",null,null,null,null,null,null,null,""]
["Circuit 12",{"$f":"IF(ISBLANK(Circuits!J14),\" \",(Circuits!J14))","v":" "},{"$f":"IF(ISBLANK(Circuits!K14),\" \",(Circuits!K14))","v":" "},null,null," ",null,"SUR"," ",null,null,null,null,null,null,null,""]
["Circuit 13",{"$f":"IF(ISBLANK(Circuits!J15),\" \",(Circuits!J15))","v":" "},{"$f":"IF(ISBLANK(Circuits!K15),\" \",(Circuits!K15))","v":" "},null,null," ",null,"SUR"," ",null,null,null,null,null,null,null,""]
["Circuit 14",{"$f":"IF(ISBLANK(Circuits!J16),\" \",(Circuits!J16))","v":" "},{"$f":"IF(ISBLANK(Circuits!K16),\" \",(Circuits!K16))","v":" "},null,null," ",null,"SUR"," ",null,null,null,null,null,null,null,""]
["Circuit 15",{"$f":"IF(ISBLANK(Circuits!J17),\" \",(Circuits!J17))","v":" "},{"$f":"IF(ISBLANK(Circuits!K17),\" \",(Circuits!K17))","v":" "},null,null," ",null,"SUR"," ",null,null,null,null,null,null,null,""]
["Circuit 16",{"$f":"IF(ISBLANK(Circuits!J18),\" \",(Circuits!J18))","v":" "},{"$f":"IF(ISBLANK(Circuits!K18),\" \",(Circuits!K18))","v":" "},null,null," ",null,"SUR"," ",null,null,null,null,null,null,null,""]
["Circuit 17",{"$f":"IF(ISBLANK(Circuits!J19),\" \",(Circuits!J19))","v":" "},{"$f":"IF(ISBLANK(Circuits!K19),\" \",(Circuits!K19))","v":" "},null,null," ",null,"SUR"," ",null,null,null,null,null,null,null,""]
["Circuit 18",{"$f":"IF(ISBLANK(Circuits!J20),\" \",(Circuits!J20))","v":" "},{"$f":"IF(ISBLANK(Circuits!K20),\" \",(Circuits!K20))","v":" "},null,null," ",null,"SUR"," ",null,null,null,null,null,null,null,""]
["Circuit 19",{"$f":"IF(ISBLANK(Circuits!J21),\" \",(Circuits!J21))","v":" "},{"$f":"IF(ISBLANK(Circuits!K21),\" \",(Circuits!K21))","v":" "},null,null," ",null,"SUR"," ",null,null,null,null,null,null,null,""]
["Circuit 20",{"$f":"IF(ISBLANK(Circuits!J22),\" \",(Circuits!J22))","v":" "},{"$f":"IF(ISBLANK(Circuits!K22),\" \",(Circuits!K22))","v":" "},null,null," ",null,"SUR"," ",null,null,null,null,null,null,null,""]
[null,null,null,null,null,null,null,null,null,null,null,null,null,null,null,null,{"$f":"CONCATENATE(Q3,Q4,Q5,Q6,Q7,Q8,Q9,Q10,Q11,Q12,Q13,Q14,Q15,Q16,Q17,Q18,Q19,Q20,Q21,Q22)","v":""}]
[null,null,null,"TEMPS TOTAL",null,{"$f":"SUM(F3:F22)","v":"00:00:00"}]
[]
[null,null,null,"TEMPS MOYEN",null,{"$f":"IF(ISBLANK(D3),\" \",AVERAGE(F3:F22))","v":" "}]
[]
[null,null,null,"NB TOTAL BALISES",null,null,{"$f":"SUM(G3:G22)","v":0},"SUR",{"$f":"SUM(I3:I22)","v":0}]
[]
[null,null,null,{"$f":"COUNTA(D3:D22)","v":0},{"$f":"COUNTA(E3:E22)","v":0}]

{"sheet":"E5","index":9,"n_rows":30,"n_cols":17,"rows_kept":30,"cut":false,"hidden":false,"merged":[]}
[null,null,null,"EQUIPE ",5,null," ",null," ",{"$f":"NOW()","v":43688.614419444442}]
[null,"BALISES","NB","DEPART","ARRIVEE","TEMPS","NB Trouvées"]
["Circuit 1",{"$f":"IF(ISBLANK(Circuits!L3),\" \",(Circuits!L3))","v":" "},{"$f":"IF(ISBLANK(Circuits!M3),\" \",(Circuits!M3))","v":" "},null,null,{"$f":"IF(ISBLANK(E3),\" \",E3-D3)","v":" "},null,"SUR",{"$f":"IF(ISBLANK(D3),\" \",C3)","v":" "},null,null,null,null,null,null,null,{"$f":"IF(COUNTA(D3)=COUNTA(E3),\"\",B3)","v":""}]
["Circuit 2",{"$f":"IF(ISBLANK(Circuits!L4),\" \",(Circuits!L4))","v":" "},{"$f":"IF(ISBLANK(Circuits!M4),\" \",(Circuits!M4))","v":" "},null,null," ",null,"SUR",{"$f":"IF(ISBLANK(D4),\" \",C4)","v":" "},null,null,null,null,null,null,null,{"$f":"IF(COUNTA(D4)=COUNTA(E4),\"\",B4)","v":""}]
["Circuit 3",{"$f":"IF(ISBLANK(Circuits!L5),\" \",(Circuits!L5))","v":" "},{"$f":"IF(ISBLANK(Circuits!M5),\" \",(Circuits!M5))","v":" "},null,null," ",null,"SUR"," ",null,null,null,null,null,{"$f":"IF(ISBLANK('Liste classe'!E7),\" \",('Liste classe'!E7))","v":" "},null,""]
["Circuit 4",{"$f":"IF(ISBLANK(Circuits!L6),\" \",(Circuits!L6))","v":" "},{"$f":"IF(ISBLANK(Circuits!M6),\" \",(Circuits!M6))","v":" "},null,null," ",null,"SUR"," ",null,null,null,null,null,{"$f":"IF(ISBLANK('Liste classe'!F7),\" \",('Liste classe'!F7))","v":" "},null,""]
["Circuit 5",{"$f":"IF(ISBLANK(Circuits!L7),\" \",(Circuits!L7))","v":" "},{"$f":"IF(ISBLANK(Circuits!M7),\" \",(Circuits!M7))","v":" "},null,null," ",null,"SUR"," ",null,null,null,null,null,{"$f":"IF(ISBLANK('Liste classe'!G7),\" \",('Liste classe'!G7))","v":" "},null,""]
["Circuit 6",{"$f":"IF(ISBLANK(Circuits!L8),\" \",(Circuits!L8))","v":" "},{"$f":"IF(ISBLANK(Circuits!M8),\" \",(Circuits!M8))","v":" "},null,null," ",null,"SUR"," ",null,null,null,null,null,{"$f":"IF(ISBLANK('Liste classe'!H7),\" \",('Liste classe'!H7))","v":" "},null,""]
["Circuit 7",{"$f":"IF(ISBLANK(Circuits!L9),\" \",(Circuits!L9))","v":" "},{"$f":"IF(ISBLANK(Circuits!M9),\" \",(Circuits!M9))","v":" "},null,null," ",null,"SUR"," ",null,null,null,null,null,{"$f":"IF(ISBLANK('Liste classe'!I7),\" \",('Liste classe'!I7))","v":" "},null,""]
["Circuit 8",{"$f":"IF(ISBLANK(Circuits!L10),\" \",(Circuits!L10))","v":" "},{"$f":"IF(ISBLANK(Circuits!M10),\" \",(Circuits!M10))","v":" "},null,null," ",null,"SUR"," ",null,null,null,null,null,{"$f":"IF(ISBLANK('Liste classe'!J7),\" \",('Liste classe'!J7))","v":" "},null,""]
["Circuit 9",{"$f":"IF(ISBLANK(Circuits!L11),\" \",(Circuits!L11))","v":" "},{"$f":"IF(ISBLANK(Circuits!M11),\" \",(Circuits!M11))","v":" "},null,null," ",null,"SUR"," ",null,null,null,null,null,null,null,""]
["Circuit 10",{"$f":"IF(ISBLANK(Circuits!L12),\" \",(Circuits!L12))","v":" "},{"$f":"IF(ISBLANK(Circuits!M12),\" \",(Circuits!M12))","v":" "},null,null," ",null,"SUR"," ",null,null,null,null,null,null,null,""]
["Circuit 11",{"$f":"IF(ISBLANK(Circuits!L13),\" \",(Circuits!L13))","v":" "},{"$f":"IF(ISBLANK(Circuits!M13),\" \",(Circuits!M13))","v":" "},null,null," ",null,"SUR"," ",null,null,null,null,null,null,null,""]
["Circuit 12",{"$f":"IF(ISBLANK(Circuits!L14),\" \",(Circuits!L14))","v":" "},{"$f":"IF(ISBLANK(Circuits!M14),\" \",(Circuits!M14))","v":" "},null,null," ",null,"SUR"," ",null,null,null,null,null,null,null,""]
["Circuit 13",{"$f":"IF(ISBLANK(Circuits!L15),\" \",(Circuits!L15))","v":" "},{"$f":"IF(ISBLANK(Circuits!M15),\" \",(Circuits!M15))","v":" "},null,null," ",null,"SUR"," ",null,null,null,null,null,null,null,""]
["Circuit 14",{"$f":"IF(ISBLANK(Circuits!L16),\" \",(Circuits!L16))","v":" "},{"$f":"IF(ISBLANK(Circuits!M16),\" \",(Circuits!M16))","v":" "},null,null," ",null,"SUR"," ",null,null,null,null,null,null,null,""]
["Circuit 15",{"$f":"IF(ISBLANK(Circuits!L17),\" \",(Circuits!L17))","v":" "},{"$f":"IF(ISBLANK(Circuits!M17),\" \",(Circuits!M17))","v":" "},null,null," ",null,"SUR"," ",null,null,null,null,null,null,null,""]
["Circuit 16",{"$f":"IF(ISBLANK(Circuits!L18),\" \",(Circuits!L18))","v":" "},{"$f":"IF(ISBLANK(Circuits!M18),\" \",(Circuits!M18))","v":" "},null,null," ",null,"SUR"," ",null,null,null,null,null,null,null,""]
["Circuit 17",{"$f":"IF(ISBLANK(Circuits!L19),\" \",(Circuits!L19))","v":" "},{"$f":"IF(ISBLANK(Circuits!M19),\" \",(Circuits!M19))","v":" "},null,null," ",null,"SUR"," ",null,null,null,null,null,null,null,""]
["Circuit 18",{"$f":"IF(ISBLANK(Circuits!L20),\" \",(Circuits!L20))","v":" "},{"$f":"IF(ISBLANK(Circuits!M20),\" \",(Circuits!M20))","v":" "},null,null," ",null,"SUR"," ",null,null,null,null,null,null,null,""]
["Circuit 19",{"$f":"IF(ISBLANK(Circuits!L21),\" \",(Circuits!L21))","v":" "},{"$f":"IF(ISBLANK(Circuits!M21),\" \",(Circuits!M21))","v":" "},null,null," ",null,"SUR"," ",null,null,null,null,null,null,null,""]
["Circuit 20",{"$f":"IF(ISBLANK(Circuits!L22),\" \",(Circuits!L22))","v":" "},{"$f":"IF(ISBLANK(Circuits!M22),\" \",(Circuits!M22))","v":" "},null,null," ",null,"SUR"," ",null,null,null,null,null,null,null,""]
[null,null,null,null,null,null,null,null,null,null,null,null,null,null,null,null,{"$f":"CONCATENATE(Q3,Q4,Q5,Q6,Q7,Q8,Q9,Q10,Q11,Q12,Q13,Q14,Q15,Q16,Q17,Q18,Q19,Q20,Q21,Q22)","v":""}]
[null,null,null,"TEMPS TOTAL",null,{"$f":"SUM(F3:F22)","v":"00:00:00"}]
[]
[null,null,null,"TEMPS MOYEN",null,{"$f":"IF(ISBLANK(D3),\" \",AVERAGE(F3:F22))","v":" "}]
[]
[null,null,null,"NB TOTAL BALISES",null,null,{"$f":"SUM(G3:G22)","v":0},"SUR",{"$f":"SUM(I3:I22)","v":0}]
[]
[null,null,null,{"$f":"COUNTA(D3:D22)","v":0},{"$f":"COUNTA(E3:E22)","v":0}]

{"sheet":"E6","index":10,"n_rows":30,"n_cols":17,"rows_kept":30,"cut":false,"hidden":false,"merged":[]}
[null,null,null,"EQUIPE ",6,null," ",null," ",{"$f":"NOW()","v":43688.614419444442}]
[null,"BALISES","NB","DEPART","ARRIVEE","TEMPS","NB Trouvées"]
["Circuit 1",{"$f":"IF(ISBLANK(Circuits!N3),\" \",(Circuits!N3))","v":" "},{"$f":"IF(ISBLANK(Circuits!O3),\" \",(Circuits!O3))","v":" "},null,null,{"$f":"IF(ISBLANK(E3),\" \",E3-D3)","v":" "},null,"SUR",{"$f":"IF(ISBLANK(D3),\" \",C3)","v":" "},null,null,null,null,null,null,null,{"$f":"IF(COUNTA(D3)=COUNTA(E3),\"\",B3)","v":""}]
["Circuit 2",{"$f":"IF(ISBLANK(Circuits!N4),\" \",(Circuits!N4))","v":" "},{"$f":"IF(ISBLANK(Circuits!O4),\" \",(Circuits!O4))","v":" "},null,null," ",null,"SUR",{"$f":"IF(ISBLANK(D4),\" \",C4)","v":" "},null,null,null,null,null,null,null,{"$f":"IF(COUNTA(D4)=COUNTA(E4),\"\",B4)","v":""}]
["Circuit 3",{"$f":"IF(ISBLANK(Circuits!N5),\" \",(Circuits!N5))","v":" "},{"$f":"IF(ISBLANK(Circuits!O5),\" \",(Circuits!O5))","v":" "},null,null," ",null,"SUR"," ",null,null,null,null,null,{"$f":"IF(ISBLANK('Liste classe'!E8),\" \",('Liste classe'!E8))","v":" "},null,""]
["Circuit 4",{"$f":"IF(ISBLANK(Circuits!N6),\" \",(Circuits!N6))","v":" "},{"$f":"IF(ISBLANK(Circuits!O6),\" \",(Circuits!O6))","v":" "},null,null," ",null,"SUR"," ",null,null,null,null,null,{"$f":"IF(ISBLANK('Liste classe'!F8),\" \",('Liste classe'!F8))","v":" "},null,""]
["Circuit 5",{"$f":"IF(ISBLANK(Circuits!N7),\" \",(Circuits!N7))","v":" "},{"$f":"IF(ISBLANK(Circuits!O7),\" \",(Circuits!O7))","v":" "},null,null," ",null,"SUR"," ",null,null,null,null,null,{"$f":"IF(ISBLANK('Liste classe'!G8),\" \",('Liste classe'!G8))","v":" "},null,""]
["Circuit 6",{"$f":"IF(ISBLANK(Circuits!N8),\" \",(Circuits!N8))","v":" "},{"$f":"IF(ISBLANK(Circuits!O8),\" \",(Circuits!O8))","v":" "},null,null," ",null,"SUR"," ",null,null,null,null,null,{"$f":"IF(ISBLANK('Liste classe'!H8),\" \",('Liste classe'!H8))","v":" "},null,""]
["Circuit 7",{"$f":"IF(ISBLANK(Circuits!N9),\" \",(Circuits!N9))","v":" "},{"$f":"IF(ISBLANK(Circuits!O9),\" \",(Circuits!O9))","v":" "},null,null," ",null,"SUR"," ",null,null,null,null,null,{"$f":"IF(ISBLANK('Liste classe'!I8),\" \",('Liste classe'!I8))","v":" "},null,""]
["Circuit 8",{"$f":"IF(ISBLANK(Circuits!N10),\" \",(Circuits!N10))","v":" "},{"$f":"IF(ISBLANK(Circuits!O10),\" \",(Circuits!O10))","v":" "},null,null," ",null,"SUR"," ",null,null,null,null,null,{"$f":"IF(ISBLANK('Liste classe'!J8),\" \",('Liste classe'!J8))","v":" "},null,""]
["Circuit 9",{"$f":"IF(ISBLANK(Circuits!N11),\" \",(Circuits!N11))","v":" "},{"$f":"IF(ISBLANK(Circuits!O11),\" \",(Circuits!O11))","v":" "},null,null," ",null,"SUR"," ",null,null,null,null,null,null,null,""]
["Circuit 10",{"$f":"IF(ISBLANK(Circuits!N12),\" \",(Circuits!N12))","v":" "},{"$f":"IF(ISBLANK(Circuits!O12),\" \",(Circuits!O12))","v":" "},null,null," ",null,"SUR"," ",null,null,null,null,null,null,null,""]
["Circuit 11",{"$f":"IF(ISBLANK(Circuits!N13),\" \",(Circuits!N13))","v":" "},{"$f":"IF(ISBLANK(Circuits!O13),\" \",(Circuits!O13))","v":" "},null,null," ",null,"SUR"," ",null,null,null,null,null,null,null,""]
["Circuit 12",{"$f":"IF(ISBLANK(Circuits!N14),\" \",(Circuits!N14))","v":" "},{"$f":"IF(ISBLANK(Circuits!O14),\" \",(Circuits!O14))","v":" "},null,null," ",null,"SUR"," ",null,null,null,null,null,null,null,""]
["Circuit 13",{"$f":"IF(ISBLANK(Circuits!N15),\" \",(Circuits!N15))","v":" "},{"$f":"IF(ISBLANK(Circuits!O15),\" \",(Circuits!O15))","v":" "},null,null," ",null,"SUR"," ",null,null,null,null,null,null,null,""]
["Circuit 14",{"$f":"IF(ISBLANK(Circuits!N16),\" \",(Circuits!N16))","v":" "},{"$f":"IF(ISBLANK(Circuits!O16),\" \",(Circuits!O16))","v":" "},null,null," ",null,"SUR"," ",null,null,null,null,null,null,null,""]
["Circuit 15",{"$f":"IF(ISBLANK(Circuits!N17),\" \",(Circuits!N17))","v":" "},{"$f":"IF(ISBLANK(Circuits!O17),\" \",(Circuits!O17))","v":" "},null,null," ",null,"SUR"," ",null,null,null,null,null,null,null,""]
["Circuit 16",{"$f":"IF(ISBLANK(Circuits!N18),\" \",(Circuits!N18))","v":" "},{"$f":"IF(ISBLANK(Circuits!O18),\" \",(Circuits!O18))","v":" "},null,null," ",null,"SUR"," ",null,null,null,null,null,null,null,""]
["Circuit 17",{"$f":"IF(ISBLANK(Circuits!N19),\" \",(Circuits!N19))","v":" "},{"$f":"IF(ISBLANK(Circuits!O19),\" \",(Circuits!O19))","v":" "},null,null," ",null,"SUR"," ",null,null,null,null,null,null,null,""]
["Circuit 18",{"$f":"IF(ISBLANK(Circuits!N20),\" \",(Circuits!N20))","v":" "},{"$f":"IF(ISBLANK(Circuits!O20),\" \",(Circuits!O20))","v":" "},null,null," ",null,"SUR"," ",null,null,null,null,null,null,null,""]
["Circuit 19",{"$f":"IF(ISBLANK(Circuits!N21),\" \",(Circuits!N21))","v":" "},{"$f":"IF(ISBLANK(Circuits!O21),\" \",(Circuits!O21))","v":" "},null,null," ",null,"SUR"," ",null,null,null,null,null,null,null,""]
["Circuit 20",{"$f":"IF(ISBLANK(Circuits!N22),\" \",(Circuits!N22))","v":" "},{"$f":"IF(ISBLANK(Circuits!O22),\" \",(Circuits!O22))","v":" "},null,null," ",null,"SUR"," ",null,null,null,null,null,null,null,""]
[null,null,null,null,null,null,null,null,null,null,null,null,null,null,null,null,{"$f":"CONCATENATE(Q3,Q4,Q5,Q6,Q7,Q8,Q9,Q10,Q11,Q12,Q13,Q14,Q15,Q16,Q17,Q18,Q19,Q20,Q21,Q22)","v":""}]
[null,null,null,"TEMPS TOTAL",null,{"$f":"SUM(F3:F22)","v":"00:00:00"}]
[]
[null,null,null,"TEMPS MOYEN",null,{"$f":"IF(ISBLANK(D3),\" \",AVERAGE(F3:F22))","v":" "}]
[]
[null,null,null,"NB TOTAL BALISES",null,null,{"$f":"SUM(G3:G22)","v":0},"SUR",{"$f":"SUM(I3:I22)","v":0}]
[]
[null,null,null,{"$f":"COUNTA(D3:D22)","v":0},{"$f":"COUNTA(E3:E22)","v":0}]

{"sheet":"E7","index":11,"n_rows":30,"n_cols":17,"rows_kept":30,"cut":false,"hidden":false,"merged":[]}
[null,null,null,"EQUIPE ",7,null," ",null," ",{"$f":"NOW()","v":43688.614419444442}]
[null,"BALISES","NB","DEPART","ARRIVEE","TEMPS","NB Trouvées"]
["Circuit 1",{"$f":"IF(ISBLANK(Circuits!P3),\" \",(Circuits!P3))","v":" "},{"$f":"IF(ISBLANK(Circuits!Q3),\" \",(Circuits!Q3))","v":" "},null,null,{"$f":"IF(ISBLANK(E3),\" \",E3-D3)","v":" "},null,"SUR",{"$f":"IF(ISBLANK(D3),\" \",C3)","v":" "},null,null,null,null,null,null,null,{"$f":"IF(COUNTA(D3)=COUNTA(E3),\"\",B3)","v":""}]
["Circuit 2",{"$f":"IF(ISBLANK(Circuits!P4),\" \",(Circuits!P4))","v":" "},{"$f":"IF(ISBLANK(Circuits!Q4),\" \",(Circuits!Q4))","v":" "},null,null," ",null,"SUR",{"$f":"IF(ISBLANK(D4),\" \",C4)","v":" "},null,null,null,null,null,null,null,{"$f":"IF(COUNTA(D4)=COUNTA(E4),\"\",B4)","v":""}]
["Circuit 3",{"$f":"IF(ISBLANK(Circuits!P5),\" \",(Circuits!P5))","v":" "},{"$f":"IF(ISBLANK(Circuits!Q5),\" \",(Circuits!Q5))","v":" "},null,null," ",null,"SUR"," ",null,null,null,null,null,{"$f":"IF(ISBLANK('Liste classe'!E9),\" \",('Liste classe'!E9))","v":" "},null,""]
["Circuit 4",{"$f":"IF(ISBLANK(Circuits!P6),\" \",(Circuits!P6))","v":" "},{"$f":"IF(ISBLANK(Circuits!Q6),\" \",(Circuits!Q6))","v":" "},null,null," ",null,"SUR"," ",null,null,null,null,null,{"$f":"IF(ISBLANK('Liste classe'!F9),\" \",('Liste classe'!F9))","v":" "},null,""]
["Circuit 5",{"$f":"IF(ISBLANK(Circuits!P7),\" \",(Circuits!P7))","v":" "},{"$f":"IF(ISBLANK(Circuits!Q7),\" \",(Circuits!Q7))","v":" "},null,null," ",null,"SUR"," ",null,null,null,null,null,{"$f":"IF(ISBLANK('Liste classe'!G9),\" \",('Liste classe'!G9))","v":" "},null,""]
["Circuit 6",{"$f":"IF(ISBLANK(Circuits!P8),\" \",(Circuits!P8))","v":" "},{"$f":"IF(ISBLANK(Circuits!Q8),\" \",(Circuits!Q8))","v":" "},null,null," ",null,"SUR"," ",null,null,null,null,null,{"$f":"IF(ISBLANK('Liste classe'!H9),\" \",('Liste classe'!H9))","v":" "},null,""]
["Circuit 7",{"$f":"IF(ISBLANK(Circuits!P9),\" \",(Circuits!P9))","v":" "},{"$f":"IF(ISBLANK(Circuits!Q9),\" \",(Circuits!Q9))","v":" "},null,null," ",null,"SUR"," ",null,null,null,null,null,{"$f":"IF(ISBLANK('Liste classe'!I9),\" \",('Liste classe'!I9))","v":" "},null,""]
["Circuit 8",{"$f":"IF(ISBLANK(Circuits!P10),\" \",(Circuits!P10))","v":" "},{"$f":"IF(ISBLANK(Circuits!Q10),\" \",(Circuits!Q10))","v":" "},null,null," ",null,"SUR"," ",null,null,null,null,null,{"$f":"IF(ISBLANK('Liste classe'!J9),\" \",('Liste classe'!J9))","v":" "},null,""]
["Circuit 9",{"$f":"IF(ISBLANK(Circuits!P11),\" \",(Circuits!P11))","v":" "},{"$f":"IF(ISBLANK(Circuits!Q11),\" \",(Circuits!Q11))","v":" "},null,null," ",null,"SUR"," ",null,null,null,null,null,null,null,""]
["Circuit 10",{"$f":"IF(ISBLANK(Circuits!P12),\" \",(Circuits!P12))","v":" "},{"$f":"IF(ISBLANK(Circuits!Q12),\" \",(Circuits!Q12))","v":" "},null,null," ",null,"SUR"," ",null,null,null,null,null,null,null,""]
["Circuit 11",{"$f":"IF(ISBLANK(Circuits!P13),\" \",(Circuits!P13))","v":" "},{"$f":"IF(ISBLANK(Circuits!Q13),\" \",(Circuits!Q13))","v":" "},null,null," ",null,"SUR"," ",null,null,null,null,null,null,null,""]
["Circuit 12",{"$f":"IF(ISBLANK(Circuits!P14),\" \",(Circuits!P14))","v":" "},{"$f":"IF(ISBLANK(Circuits!Q14),\" \",(Circuits!Q14))","v":" "},null,null," ",null,"SUR"," ",null,null,null,null,null,null,null,""]
["Circuit 13",{"$f":"IF(ISBLANK(Circuits!P15),\" \",(Circuits!P15))","v":" "},{"$f":"IF(ISBLANK(Circuits!Q15),\" \",(Circuits!Q15))","v":" "},null,null," ",null,"SUR"," ",null,null,null,null,null,null,null,""]
["Circuit 14",{"$f":"IF(ISBLANK(Circuits!P16),\" \",(Circuits!P16))","v":" "},{"$f":"IF(ISBLANK(Circuits!Q16),\" \",(Circuits!Q16))","v":" "},null,null," ",null,"SUR"," ",null,null,null,null,null,null,null,""]
["Circuit 15",{"$f":"IF(ISBLANK(Circuits!P17),\" \",(Circuits!P17))","v":" "},{"$f":"IF(ISBLANK(Circuits!Q17),\" \",(Circuits!Q17))","v":" "},null,null," ",null,"SUR"," ",null,null,null,null,null,null,null,""]
["Circuit 16",{"$f":"IF(ISBLANK(Circuits!P18),\" \",(Circuits!P18))","v":" "},{"$f":"IF(ISBLANK(Circuits!Q18),\" \",(Circuits!Q18))","v":" "},null,null," ",null,"SUR"," ",null,null,null,null,null,null,null,""]
["Circuit 17",{"$f":"IF(ISBLANK(Circuits!P19),\" \",(Circuits!P19))","v":" "},{"$f":"IF(ISBLANK(Circuits!Q19),\" \",(Circuits!Q19))","v":" "},null,null," ",null,"SUR"," ",null,null,null,null,null,null,null,""]
["Circuit 18",{"$f":"IF(ISBLANK(Circuits!P20),\" \",(Circuits!P20))","v":" "},{"$f":"IF(ISBLANK(Circuits!Q20),\" \",(Circuits!Q20))","v":" "},null,null," ",null,"SUR"," ",null,null,null,null,null,null,null,""]
["Circuit 19",{"$f":"IF(ISBLANK(Circuits!P21),\" \",(Circuits!P21))","v":" "},{"$f":"IF(ISBLANK(Circuits!Q21),\" \",(Circuits!Q21))","v":" "},null,null," ",null,"SUR"," ",null,null,null,null,null,null,null,""]
["Circuit 20",{"$f":"IF(ISBLANK(Circuits!P22),\" \",(Circuits!P22))","v":" "},{"$f":"IF(ISBLANK(Circuits!Q22),\" \",(Circuits!Q22))","v":" "},null,null," ",null,"SUR"," ",null,null,null,null,null,null,null,""]
[null,null,null,null,null,null,null,null,null,null,null,null,null,null,null,null,{"$f":"CONCATENATE(Q3,Q4,Q5,Q6,Q7,Q8,Q9,Q10,Q11,Q12,Q13,Q14,Q15,Q16,Q17,Q18,Q19,Q20,Q21,Q22)","v":""}]
[null,null,null,"TEMPS TOTAL",null,{"$f":"SUM(F3:F22)","v":"00:00:00"}]
[]
[null,null,null,"TEMPS MOYEN",null,{"$f":"IF(ISBLANK(D3),\" \",AVERAGE(F3:F22))","v":" "}]
[]
[null,null,null,"NB TOTAL BALISES",null,null,{"$f":"SUM(G3:G22)","v":0},"SUR",{"$f":"SUM(I3:I22)","v":0}]
[]
[null,null,null,{"$f":"COUNTA(D3:D22)","v":0},{"$f":"COUNTA(E3:E22)","v":0}]

{"sheet":"E8","index":12,"n_rows":30,"n_cols":17,"rows_kept":30,"cut":false,"hidden":false,"merged":[]}
[null,null,null,"EQUIPE ",8,null," ",null," ",{"$f":"NOW()","v":43688.614419444442}]
[null,"BALISES","NB","DEPART","ARRIVEE","TEMPS","NB Trouvées"]
["Circuit 1",{"$f":"IF(ISBLANK(Circuits!R3),\" \",(Circuits!R3))","v":" "},{"$f":"IF(ISBLANK(Circuits!S3),\" \",(Circuits!S3))","v":" "},null,null,{"$f":"IF(ISBLANK(E3),\" \",E3-D3)","v":" "},null,"SUR",{"$f":"IF(ISBLANK(D3),\" \",C3)","v":" "},null,null,null,null,null,null,null,{"$f":"IF(COUNTA(D3)=COUNTA(E3),\"\",B3)","v":""}]
["Circuit 2",{"$f":"IF(ISBLANK(Circuits!R4),\" \",(Circuits!R4))","v":" "},{"$f":"IF(ISBLANK(Circuits!S4),\" \",(Circuits!S4))","v":" "},null,null," ",null,"SUR",{"$f":"IF(ISBLANK(D4),\" \",C4)","v":" "},null,null,null,null,null,null,null,{"$f":"IF(COUNTA(D4)=COUNTA(E4),\"\",B4)","v":""}]
["Circuit 3",{"$f":"IF(ISBLANK(Circuits!R5),\" \",(Circuits!R5))","v":" "},{"$f":"IF(ISBLANK(Circuits!S5),\" \",(Circuits!S5))","v":" "},null,null," ",null,"SUR"," ",null,null,null,null,null,{"$f":"IF(ISBLANK('Liste classe'!E10),\" \",('Liste classe'!E10))","v":" "},null,""]
["Circuit 4",{"$f":"IF(ISBLANK(Circuits!R6),\" \",(Circuits!R6))","v":" "},{"$f":"IF(ISBLANK(Circuits!S6),\" \",(Circuits!S6))","v":" "},null,null," ",null,"SUR"," ",null,null,null,null,null,{"$f":"IF(ISBLANK('Liste classe'!F10),\" \",('Liste classe'!F10))","v":" "},null,""]
["Circuit 5",{"$f":"IF(ISBLANK(Circuits!R7),\" \",(Circuits!R7))","v":" "},{"$f":"IF(ISBLANK(Circuits!S7),\" \",(Circuits!S7))","v":" "},null,null," ",null,"SUR"," ",null,null,null,null,null,{"$f":"IF(ISBLANK('Liste classe'!G10),\" \",('Liste classe'!G10))","v":" "},null,""]
["Circuit 6",{"$f":"IF(ISBLANK(Circuits!R8),\" \",(Circuits!R8))","v":" "},{"$f":"IF(ISBLANK(Circuits!S8),\" \",(Circuits!S8))","v":" "},null,null," ",null,"SUR"," ",null,null,null,null,null,{"$f":"IF(ISBLANK('Liste classe'!H10),\" \",('Liste classe'!H10))","v":" "},null,""]
["Circuit 7",{"$f":"IF(ISBLANK(Circuits!R9),\" \",(Circuits!R9))","v":" "},{"$f":"IF(ISBLANK(Circuits!S9),\" \",(Circuits!S9))","v":" "},null,null," ",null,"SUR"," ",null,null,null,null,null,{"$f":"IF(ISBLANK('Liste classe'!I10),\" \",('Liste classe'!I10))","v":" "},null,""]
["Circuit 8",{"$f":"IF(ISBLANK(Circuits!R10),\" \",(Circuits!R10))","v":" "},{"$f":"IF(ISBLANK(Circuits!S10),\" \",(Circuits!S10))","v":" "},null,null," ",null,"SUR"," ",null,null,null,null,null,{"$f":"IF(ISBLANK('Liste classe'!J10),\" \",('Liste classe'!J10))","v":" "},null,""]
["Circuit 9",{"$f":"IF(ISBLANK(Circuits!R11),\" \",(Circuits!R11))","v":" "},{"$f":"IF(ISBLANK(Circuits!S11),\" \",(Circuits!S11))","v":" "},null,null," ",null,"SUR"," ",null,null,null,null,null,null,null,""]
["Circuit 10",{"$f":"IF(ISBLANK(Circuits!R12),\" \",(Circuits!R12))","v":" "},{"$f":"IF(ISBLANK(Circuits!S12),\" \",(Circuits!S12))","v":" "},null,null," ",null,"SUR"," ",null,null,null,null,null,null,null,""]
["Circuit 11",{"$f":"IF(ISBLANK(Circuits!R13),\" \",(Circuits!R13))","v":" "},{"$f":"IF(ISBLANK(Circuits!S13),\" \",(Circuits!S13))","v":" "},null,null," ",null,"SUR"," ",null,null,null,null,null,null,null,""]
["Circuit 12",{"$f":"IF(ISBLANK(Circuits!R14),\" \",(Circuits!R14))","v":" "},{"$f":"IF(ISBLANK(Circuits!S14),\" \",(Circuits!S14))","v":" "},null,null," ",null,"SUR"," ",null,null,null,null,null,null,null,""]
["Circuit 13",{"$f":"IF(ISBLANK(Circuits!R15),\" \",(Circuits!R15))","v":" "},{"$f":"IF(ISBLANK(Circuits!S15),\" \",(Circuits!S15))","v":" "},null,null," ",null,"SUR"," ",null,null,null,null,null,null,null,""]
["Circuit 14",{"$f":"IF(ISBLANK(Circuits!R16),\" \",(Circuits!R16))","v":" "},{"$f":"IF(ISBLANK(Circuits!S16),\" \",(Circuits!S16))","v":" "},null,null," ",null,"SUR"," ",null,null,null,null,null,null,null,""]
["Circuit 15",{"$f":"IF(ISBLANK(Circuits!R17),\" \",(Circuits!R17))","v":" "},{"$f":"IF(ISBLANK(Circuits!S17),\" \",(Circuits!S17))","v":" "},null,null," ",null,"SUR"," ",null,null,null,null,null,null,null,""]
["Circuit 16",{"$f":"IF(ISBLANK(Circuits!R18),\" \",(Circuits!R18))","v":" "},{"$f":"IF(ISBLANK(Circuits!S18),\" \",(Circuits!S18))","v":" "},null,null," ",null,"SUR"," ",null,null,null,null,null,null,null,""]
["Circuit 17",{"$f":"IF(ISBLANK(Circuits!R19),\" \",(Circuits!R19))","v":" "},{"$f":"IF(ISBLANK(Circuits!S19),\" \",(Circuits!S19))","v":" "},null,null," ",null,"SUR"," ",null,null,null,null,null,null,null,""]
["Circuit 18",{"$f":"IF(ISBLANK(Circuits!R20),\" \",(Circuits!R20))","v":" "},{"$f":"IF(ISBLANK(Circuits!S20),\" \",(Circuits!S20))","v":" "},null,null," ",null,"SUR"," ",null,null,null,null,null,null,null,""]
["Circuit 19",{"$f":"IF(ISBLANK(Circuits!R21),\" \",(Circuits!R21))","v":" "},{"$f":"IF(ISBLANK(Circuits!S21),\" \",(Circuits!S21))","v":" "},null,null," ",null,"SUR"," ",null,null,null,null,null,null,null,""]
["Circuit 20",{"$f":"IF(ISBLANK(Circuits!R22),\" \",(Circuits!R22))","v":" "},{"$f":"IF(ISBLANK(Circuits!S22),\" \",(Circuits!S22))","v":" "},null,null," ",null,"SUR"," ",null,null,null,null,null,null,null,""]
[null,null,null,null,null,null,null,null,null,null,null,null,null,null,null,null,{"$f":"CONCATENATE(Q3,Q4,Q5,Q6,Q7,Q8,Q9,Q10,Q11,Q12,Q13,Q14,Q15,Q16,Q17,Q18,Q19,Q20,Q21,Q22)","v":""}]
[null,null,null,"TEMPS TOTAL",null,{"$f":"SUM(F3:F22)","v":"00:00:00"}]
[]
[null,null,null,"TEMPS MOYEN",null,{"$f":"IF(ISBLANK(D3),\" \",AVERAGE(F3:F22))","v":" "}]
[]
[null,null,null,"NB TOTAL BALISES",null,null,{"$f":"SUM(G3:G22)","v":0},"SUR",{"$f":"SUM(I3:I22)","v":0}]
[]
[null,null,null,{"$f":"COUNTA(D3:D22)","v":0},{"$f":"COUNTA(E3:E22)","v":0}]

{"sheet":"E9","index":13,"n_rows":30,"n_cols":17,"rows_kept":30,"cut":false,"hidden":false,"merged":[]}
[null,null,null,"EQUIPE ",9,null," ",null," ",{"$f":"NOW()","v":43688.614419444442}]
[null,"BALISES","NB","DEPART","ARRIVEE","TEMPS","NB Trouvées"]
["Circuit 1",{"$f":"IF(ISBLANK(Circuits!T3),\" \",(Circuits!T3))","v":" "},{"$f":"IF(ISBLANK(Circuits!U3),\" \",(Circuits!U3))","v":" "},null,null,{"$f":"IF(ISBLANK(E3),\" \",E3-D3)","v":" "},null,"SUR",{"$f":"IF(ISBLANK(D3),\" \",C3)","v":" "},null,null,null,null,null,null,null,{"$f":"IF(COUNTA(D3)=COUNTA(E3),\"\",B3)","v":""}]
["Circuit 2",{"$f":"IF(ISBLANK(Circuits!T4),\" \",(Circuits!T4))","v":" "},{"$f":"IF(ISBLANK(Circuits!U4),\" \",(Circuits!U4))","v":" "},null,null," ",null,"SUR",{"$f":"IF(ISBLANK(D4),\" \",C4)","v":" "},null,null,null,null,null,null,null,{"$f":"IF(COUNTA(D4)=COUNTA(E4),\"\",B4)","v":""}]
["Circuit 3",{"$f":"IF(ISBLANK(Circuits!T5),\" \",(Circuits!T5))","v":" "},{"$f":"IF(ISBLANK(Circuits!U5),\" \",(Circuits!U5))","v":" "},null,null," ",null,"SUR"," ",null,null,null,null,null,{"$f":"IF(ISBLANK('Liste classe'!E11),\" \",('Liste classe'!E11))","v":" "},null,""]
["Circuit 4",{"$f":"IF(ISBLANK(Circuits!T6),\" \",(Circuits!T6))","v":" "},{"$f":"IF(ISBLANK(Circuits!U6),\" \",(Circuits!U6))","v":" "},null,null," ",null,"SUR"," ",null,null,null,null,null,{"$f":"IF(ISBLANK('Liste classe'!F11),\" \",('Liste classe'!F11))","v":" "},null,""]
["Circuit 5",{"$f":"IF(ISBLANK(Circuits!T7),\" \",(Circuits!T7))","v":" "},{"$f":"IF(ISBLANK(Circuits!U7),\" \",(Circuits!U7))","v":" "},null,null," ",null,"SUR"," ",null,null,null,null,null,{"$f":"IF(ISBLANK('Liste classe'!G11),\" \",('Liste classe'!G11))","v":" "},null,""]
["Circuit 6",{"$f":"IF(ISBLANK(Circuits!T8),\" \",(Circuits!T8))","v":" "},{"$f":"IF(ISBLANK(Circuits!U8),\" \",(Circuits!U8))","v":" "},null,null," ",null,"SUR"," ",null,null,null,null,null,{"$f":"IF(ISBLANK('Liste classe'!H11),\" \",('Liste classe'!H11))","v":" "},null,""]
["Circuit 7",{"$f":"IF(ISBLANK(Circuits!T9),\" \",(Circuits!T9))","v":" "},{"$f":"IF(ISBLANK(Circuits!U9),\" \",(Circuits!U9))","v":" "},null,null," ",null,"SUR"," ",null,null,null,null,null,{"$f":"IF(ISBLANK('Liste classe'!I11),\" \",('Liste classe'!I11))","v":" "},null,""]
["Circuit 8",{"$f":"IF(ISBLANK(Circuits!T10),\" \",(Circuits!T10))","v":" "},{"$f":"IF(ISBLANK(Circuits!U10),\" \",(Circuits!U10))","v":" "},null,null," ",null,"SUR"," ",null,null,null,null,null,{"$f":"IF(ISBLANK('Liste classe'!J11),\" \",('Liste classe'!J11))","v":" "},null,""]
["Circuit 9",{"$f":"IF(ISBLANK(Circuits!T11),\" \",(Circuits!T11))","v":" "},{"$f":"IF(ISBLANK(Circuits!U11),\" \",(Circuits!U11))","v":" "},null,null," ",null,"SUR"," ",null,null,null,null,null,null,null,""]
["Circuit 10",{"$f":"IF(ISBLANK(Circuits!T12),\" \",(Circuits!T12))","v":" "},{"$f":"IF(ISBLANK(Circuits!U12),\" \",(Circuits!U12))","v":" "},null,null," ",null,"SUR"," ",null,null,null,null,null,null,null,""]
["Circuit 11",{"$f":"IF(ISBLANK(Circuits!T13),\" \",(Circuits!T13))","v":" "},{"$f":"IF(ISBLANK(Circuits!U13),\" \",(Circuits!U13))","v":" "},null,null," ",null,"SUR"," ",null,null,null,null,null,null,null,""]
["Circuit 12",{"$f":"IF(ISBLANK(Circuits!T14),\" \",(Circuits!T14))","v":" "},{"$f":"IF(ISBLANK(Circuits!U14),\" \",(Circuits!U14))","v":" "},null,null," ",null,"SUR"," ",null,null,null,null,null,null,null,""]
["Circuit 13",{"$f":"IF(ISBLANK(Circuits!T15),\" \",(Circuits!T15))","v":" "},{"$f":"IF(ISBLANK(Circuits!U15),\" \",(Circuits!U15))","v":" "},null,null," ",null,"SUR"," ",null,null,null,null,null,null,null,""]
["Circuit 14",{"$f":"IF(ISBLANK(Circuits!T16),\" \",(Circuits!T16))","v":" "},{"$f":"IF(ISBLANK(Circuits!U16),\" \",(Circuits!U16))","v":" "},null,null," ",null,"SUR"," ",null,null,null,null,null,null,null,""]
["Circuit 15",{"$f":"IF(ISBLANK(Circuits!T17),\" \",(Circuits!T17))","v":" "},{"$f":"IF(ISBLANK(Circuits!U17),\" \",(Circuits!U17))","v":" "},null,null," ",null,"SUR"," ",null,null,null,null,null,null,null,""]
["Circuit 16",{"$f":"IF(ISBLANK(Circuits!T18),\" \",(Circuits!T18))","v":" "},{"$f":"IF(ISBLANK(Circuits!U18),\" \",(Circuits!U18))","v":" "},null,null," ",null,"SUR"," ",null,null,null,null,null,null,null,""]
["Circuit 17",{"$f":"IF(ISBLANK(Circuits!T19),\" \",(Circuits!T19))","v":" "},{"$f":"IF(ISBLANK(Circuits!U19),\" \",(Circuits!U19))","v":" "},null,null," ",null,"SUR"," ",null,null,null,null,null,null,null,""]
["Circuit 18",{"$f":"IF(ISBLANK(Circuits!T20),\" \",(Circuits!T20))","v":" "},{"$f":"IF(ISBLANK(Circuits!U20),\" \",(Circuits!U20))","v":" "},null,null," ",null,"SUR"," ",null,null,null,null,null,null,null,""]
["Circuit 19",{"$f":"IF(ISBLANK(Circuits!T21),\" \",(Circuits!T21))","v":" "},{"$f":"IF(ISBLANK(Circuits!U21),\" \",(Circuits!U21))","v":" "},null,null," ",null,"SUR"," ",null,null,null,null,null,null,null,""]
["Circuit 20",{"$f":"IF(ISBLANK(Circuits!T22),\" \",(Circuits!T22))","v":" "},{"$f":"IF(ISBLANK(Circuits!U22),\" \",(Circuits!U22))","v":" "},null,null," ",null,"SUR"," ",null,null,null,null,null,null,null,""]
[null,null,null,null,null,null,null,null,null,null,null,null,null,null,null,null,{"$f":"CONCATENATE(Q3,Q4,Q5,Q6,Q7,Q8,Q9,Q10,Q11,Q12,Q13,Q14,Q15,Q16,Q17,Q18,Q19,Q20,Q21,Q22)","v":""}]
[null,null,null,"TEMPS TOTAL",null,{"$f":"SUM(F3:F22)","v":"00:00:00"}]
[]
[null,null,null,"TEMPS MOYEN",null,{"$f":"IF(ISBLANK(D3),\" \",AVERAGE(F3:F22))","v":" "}]
[]
[null,null,null,"NB TOTAL BALISES",null,null,{"$f":"SUM(G3:G22)","v":0},"SUR",{"$f":"SUM(I3:I22)","v":0}]
[]
[null,null,null,{"$f":"COUNTA(D3:D22)","v":0},{"$f":"COUNTA(E3:E22)","v":0}]

{"sheet":"E10","index":14,"n_rows":30,"n_cols":17,"rows_kept":30,"cut":false,"hidden":false,"merged":[]}
[null,null,null,"EQUIPE ",10,null," ",null," ",{"$f":"NOW()","v":43688.614419444442}]
[null,"BALISES","NB","DEPART","ARRIVEE","TEMPS","NB Trouvées"]
["Circuit 1",{"$f":"IF(ISBLANK(Circuits!V3),\" \",(Circuits!V3))","v":" "},{"$f":"IF(ISBLANK(Circuits!W3),\" \",(Circuits!W3))","v":" "},null,null,{"$f":"IF(ISBLANK(E3),\" \",E3-D3)","v":" "},null,"SUR",{"$f":"IF(ISBLANK(D3),\" \",C3)","v":" "},null,null,null,null,null,null,null,{"$f":"IF(COUNTA(D3)=COUNTA(E3),\"\",B3)","v":""}]
["Circuit 2",{"$f":"IF(ISBLANK(Circuits!V4),\" \",(Circuits!V4))","v":" "},{"$f":"IF(ISBLANK(Circuits!W4),\" \",(Circuits!W4))","v":" "},null,null," ",null,"SUR",{"$f":"IF(ISBLANK(D4),\" \",C4)","v":" "},null,null,null,null,null,null,null,{"$f":"IF(COUNTA(D4)=COUNTA(E4),\"\",B4)","v":""}]
["Circuit 3",{"$f":"IF(ISBLANK(Circuits!V5),\" \",(Circuits!V5))","v":" "},{"$f":"IF(ISBLANK(Circuits!W5),\" \",(Circuits!W5))","v":" "},null,null," ",null,"SUR"," ",null,null,null,null,null,{"$f":"IF(ISBLANK('Liste classe'!E12),\" \",('Liste classe'!E12))","v":" "},null,""]
["Circuit 4",{"$f":"IF(ISBLANK(Circuits!V6),\" \",(Circuits!V6))","v":" "},{"$f":"IF(ISBLANK(Circuits!W6),\" \",(Circuits!W6))","v":" "},null,null," ",null,"SUR"," ",null,null,null,null,null,{"$f":"IF(ISBLANK('Liste classe'!F12),\" \",('Liste classe'!F12))","v":" "},null,""]
["Circuit 5",{"$f":"IF(ISBLANK(Circuits!V7),\" \",(Circuits!V7))","v":" "},{"$f":"IF(ISBLANK(Circuits!W7),\" \",(Circuits!W7))","v":" "},null,null," ",null,"SUR"," ",null,null,null,null,null,{"$f":"IF(ISBLANK('Liste classe'!G12),\" \",('Liste classe'!G12))","v":" "},null,""]
["Circuit 6",{"$f":"IF(ISBLANK(Circuits!V8),\" \",(Circuits!V8))","v":" "},{"$f":"IF(ISBLANK(Circuits!W8),\" \",(Circuits!W8))","v":" "},null,null," ",null,"SUR"," ",null,null,null,null,null,{"$f":"IF(ISBLANK('Liste classe'!H12),\" \",('Liste classe'!H12))","v":" "},null,""]
["Circuit 7",{"$f":"IF(ISBLANK(Circuits!V9),\" \",(Circuits!V9))","v":" "},{"$f":"IF(ISBLANK(Circuits!W9),\" \",(Circuits!W9))","v":" "},null,null," ",null,"SUR"," ",null,null,null,null,null,{"$f":"IF(ISBLANK('Liste classe'!I12),\" \",('Liste classe'!I12))","v":" "},null,""]
["Circuit 8",{"$f":"IF(ISBLANK(Circuits!V10),\" \",(Circuits!V10))","v":" "},{"$f":"IF(ISBLANK(Circuits!W10),\" \",(Circuits!W10))","v":" "},null,null," ",null,"SUR"," ",null,null,null,null,null,{"$f":"IF(ISBLANK('Liste classe'!J12),\" \",('Liste classe'!J12))","v":" "},null,""]
["Circuit 9",{"$f":"IF(ISBLANK(Circuits!V11),\" \",(Circuits!V11))","v":" "},{"$f":"IF(ISBLANK(Circuits!W11),\" \",(Circuits!W11))","v":" "},null,null," ",null,"SUR"," ",null,null,null,null,null,null,null,""]
["Circuit 10",{"$f":"IF(ISBLANK(Circuits!V12),\" \",(Circuits!V12))","v":" "},{"$f":"IF(ISBLANK(Circuits!W12),\" \",(Circuits!W12))","v":" "},null,null," ",null,"SUR"," ",null,null,null,null,null,null,null,""]
["Circuit 11",{"$f":"IF(ISBLANK(Circuits!V13),\" \",(Circuits!V13))","v":" "},{"$f":"IF(ISBLANK(Circuits!W13),\" \",(Circuits!W13))","v":" "},null,null," ",null,"SUR"," ",null,null,null,null,null,null,null,""]
["Circuit 12",{"$f":"IF(ISBLANK(Circuits!V14),\" \",(Circuits!V14))","v":" "},{"$f":"IF(ISBLANK(Circuits!W14),\" \",(Circuits!W14))","v":" "},null,null," ",null,"SUR"," ",null,null,null,null,null,null,null,""]
["Circuit 13",{"$f":"IF(ISBLANK(Circuits!V15),\" \",(Circuits!V15))","v":" "},{"$f":"IF(ISBLANK(Circuits!W15),\" \",(Circuits!W15))","v":" "},null,null," ",null,"SUR"," ",null,null,null,null,null,null,null,""]
["Circuit 14",{"$f":"IF(ISBLANK(Circuits!V16),\" \",(Circuits!V16))","v":" "},{"$f":"IF(ISBLANK(Circuits!W16),\" \",(Circuits!W16))","v":" "},null,null," ",null,"SUR"," ",null,null,null,null,null,null,null,""]
["Circuit 15",{"$f":"IF(ISBLANK(Circuits!V17),\" \",(Circuits!V17))","v":" "},{"$f":"IF(ISBLANK(Circuits!W17),\" \",(Circuits!W17))","v":" "},null,null," ",null,"SUR"," ",null,null,null,null,null,null,null,""]
["Circuit 16",{"$f":"IF(ISBLANK(Circuits!V18),\" \",(Circuits!V18))","v":" "},{"$f":"IF(ISBLANK(Circuits!W18),\" \",(Circuits!W18))","v":" "},null,null," ",null,"SUR"," ",null,null,null,null,null,null,null,""]
["Circuit 17",{"$f":"IF(ISBLANK(Circuits!V19),\" \",(Circuits!V19))","v":" "},{"$f":"IF(ISBLANK(Circuits!W19),\" \",(Circuits!W19))","v":" "},null,null," ",null,"SUR"," ",null,null,null,null,null,null,null,""]
["Circuit 18",{"$f":"IF(ISBLANK(Circuits!V20),\" \",(Circuits!V20))","v":" "},{"$f":"IF(ISBLANK(Circuits!W20),\" \",(Circuits!W20))","v":" "},null,null," ",null,"SUR"," ",null,null,null,null,null,null,null,""]
["Circuit 19",{"$f":"IF(ISBLANK(Circuits!V21),\" \",(Circuits!V21))","v":" "},{"$f":"IF(ISBLANK(Circuits!W21),\" \",(Circuits!W21))","v":" "},null,null," ",null,"SUR"," ",null,null,null,null,null,null,null,""]
["Circuit 20",{"$f":"IF(ISBLANK(Circuits!V22),\" \",(Circuits!V22))","v":" "},{"$f":"IF(ISBLANK(Circuits!W22),\" \",(Circuits!W22))","v":" "},null,null," ",null,"SUR"," ",null,null,null,null,null,null,null,""]
[null,null,null,null,null,null,null,null,null,null,null,null,null,null,null,null,{"$f":"CONCATENATE(Q3,Q4,Q5,Q6,Q7,Q8,Q9,Q10,Q11,Q12,Q13,Q14,Q15,Q16,Q17,Q18,Q19,Q20,Q21,Q22)","v":""}]
[null,null,null,"TEMPS TOTAL",null,{"$f":"SUM(F3:F22)","v":"00:00:00"}]
[]
[null,null,null,"TEMPS MOYEN",null,{"$f":"IF(ISBLANK(D3),\" \",AVERAGE(F3:F22))","v":" "}]
[]
[null,null,null,"NB TOTAL BALISES",null,null,{"$f":"SUM(G3:G22)","v":0},"SUR",{"$f":"SUM(I3:I22)","v":0}]
[]
[null,null,null,{"$f":"COUNTA(D3:D22)","v":0},{"$f":"COUNTA(E3:E22)","v":0}]

{"sheet":"E11","index":15,"n_rows":30,"n_cols":17,"rows_kept":30,"cut":false,"hidden":false,"merged":[]}
[null,null,null,"EQUIPE ",11,null," ",null," ",{"$f":"NOW()","v":43688.614419444442}]
[null,"BALISES","NB","DEPART","ARRIVEE","TEMPS","NB Trouvées"]
["Circuit 1",{"$f":"IF(ISBLANK(Circuits!X3),\" \",(Circuits!X3))","v":" "},{"$f":"IF(ISBLANK(Circuits!Y3),\" \",(Circuits!Y3))","v":" "},null,null,{"$f":"IF(ISBLANK(E3),\" \",E3-D3)","v":" "},null,"SUR",{"$f":"IF(ISBLANK(D3),\" \",C3)","v":" "},null,null,null,null,null,null,null,{"$f":"IF(COUNTA(D3)=COUNTA(E3),\"\",B3)","v":""}]
["Circuit 2",{"$f":"IF(ISBLANK(Circuits!X4),\" \",(Circuits!X4))","v":" "},{"$f":"IF(ISBLANK(Circuits!Y4),\" \",(Circuits!Y4))","v":" "},null,null," ",null,"SUR",{"$f":"IF(ISBLANK(D4),\" \",C4)","v":" "},null,null,null,null,null,null,null,{"$f":"IF(COUNTA(D4)=COUNTA(E4),\"\",B4)","v":""}]
["Circuit 3",{"$f":"IF(ISBLANK(Circuits!X5),\" \",(Circuits!X5))","v":" "},{"$f":"IF(ISBLANK(Circuits!Y5),\" \",(Circuits!Y5))","v":" "},null,null," ",null,"SUR"," ",null,null,null,null,null,{"$f":"IF(ISBLANK('Liste classe'!E13),\" \",('Liste classe'!E13))","v":" "},null,""]
["Circuit 4",{"$f":"IF(ISBLANK(Circuits!X6),\" \",(Circuits!X6))","v":" "},{"$f":"IF(ISBLANK(Circuits!Y6),\" \",(Circuits!Y6))","v":" "},null,null," ",null,"SUR"," ",null,null,null,null,null,{"$f":"IF(ISBLANK('Liste classe'!F13),\" \",('Liste classe'!F13))","v":" "},null,""]
["Circuit 5",{"$f":"IF(ISBLANK(Circuits!X7),\" \",(Circuits!X7))","v":" "},{"$f":"IF(ISBLANK(Circuits!Y7),\" \",(Circuits!Y7))","v":" "},null,null," ",null,"SUR"," ",null,null,null,null,null,{"$f":"IF(ISBLANK('Liste classe'!G13),\" \",('Liste classe'!G13))","v":" "},null,""]
["Circuit 6",{"$f":"IF(ISBLANK(Circuits!X8),\" \",(Circuits!X8))","v":" "},{"$f":"IF(ISBLANK(Circuits!Y8),\" \",(Circuits!Y8))","v":" "},null,null," ",null,"SUR"," ",null,null,null,null,null,{"$f":"IF(ISBLANK('Liste classe'!H13),\" \",('Liste classe'!H13))","v":" "},null,""]
["Circuit 7",{"$f":"IF(ISBLANK(Circuits!X9),\" \",(Circuits!X9))","v":" "},{"$f":"IF(ISBLANK(Circuits!Y9),\" \",(Circuits!Y9))","v":" "},null,null," ",null,"SUR"," ",null,null,null,null,null,{"$f":"IF(ISBLANK('Liste classe'!I13),\" \",('Liste classe'!I13))","v":" "},null,""]
["Circuit 8",{"$f":"IF(ISBLANK(Circuits!X10),\" \",(Circuits!X10))","v":" "},{"$f":"IF(ISBLANK(Circuits!Y10),\" \",(Circuits!Y10))","v":" "},null,null," ",null,"SUR"," ",null,null,null,null,null,{"$f":"IF(ISBLANK('Liste classe'!J13),\" \",('Liste classe'!J13))","v":" "},null,""]
["Circuit 9",{"$f":"IF(ISBLANK(Circuits!X11),\" \",(Circuits!X11))","v":" "},{"$f":"IF(ISBLANK(Circuits!Y11),\" \",(Circuits!Y11))","v":" "},null,null," ",null,"SUR"," ",null,null,null,null,null,null,null,""]
["Circuit 10",{"$f":"IF(ISBLANK(Circuits!X12),\" \",(Circuits!X12))","v":" "},{"$f":"IF(ISBLANK(Circuits!Y12),\" \",(Circuits!Y12))","v":" "},null,null," ",null,"SUR"," ",null,null,null,null,null,null,null,""]
["Circuit 11",{"$f":"IF(ISBLANK(Circuits!X13),\" \",(Circuits!X13))","v":" "},{"$f":"IF(ISBLANK(Circuits!Y13),\" \",(Circuits!Y13))","v":" "},null,null," ",null,"SUR"," ",null,null,null,null,null,null,null,""]
["Circuit 12",{"$f":"IF(ISBLANK(Circuits!X14),\" \",(Circuits!X14))","v":" "},{"$f":"IF(ISBLANK(Circuits!Y14),\" \",(Circuits!Y14))","v":" "},null,null," ",null,"SUR"," ",null,null,null,null,null,null,null,""]
["Circuit 13",{"$f":"IF(ISBLANK(Circuits!X15),\" \",(Circuits!X15))","v":" "},{"$f":"IF(ISBLANK(Circuits!Y15),\" \",(Circuits!Y15))","v":" "},null,null," ",null,"SUR"," ",null,null,null,null,null,null,null,""]
["Circuit 14",{"$f":"IF(ISBLANK(Circuits!X16),\" \",(Circuits!X16))","v":" "},{"$f":"IF(ISBLANK(Circuits!Y16),\" \",(Circuits!Y16))","v":" "},null,null," ",null,"SUR"," ",null,null,null,null,null,null,null,""]
["Circuit 15",{"$f":"IF(ISBLANK(Circuits!X17),\" \",(Circuits!X17))","v":" "},{"$f":"IF(ISBLANK(Circuits!Y17),\" \",(Circuits!Y17))","v":" "},null,null," ",null,"SUR"," ",null,null,null,null,null,null,null,""]
["Circuit 16",{"$f":"IF(ISBLANK(Circuits!X18),\" \",(Circuits!X18))","v":" "},{"$f":"IF(ISBLANK(Circuits!Y18),\" \",(Circuits!Y18))","v":" "},null,null," ",null,"SUR"," ",null,null,null,null,null,null,null,""]
["Circuit 17",{"$f":"IF(ISBLANK(Circuits!X19),\" \",(Circuits!X19))","v":" "},{"$f":"IF(ISBLANK(Circuits!Y19),\" \",(Circuits!Y19))","v":" "},null,null," ",null,"SUR"," ",null,null,null,null,null,null,null,""]
["Circuit 18",{"$f":"IF(ISBLANK(Circuits!X20),\" \",(Circuits!X20))","v":" "},{"$f":"IF(ISBLANK(Circuits!Y20),\" \",(Circuits!Y20))","v":" "},null,null," ",null,"SUR"," ",null,null,null,null,null,null,null,""]
["Circuit 19",{"$f":"IF(ISBLANK(Circuits!X21),\" \",(Circuits!X21))","v":" "},{"$f":"IF(ISBLANK(Circuits!Y21),\" \",(Circuits!Y21))","v":" "},null,null," ",null,"SUR"," ",null,null,null,null,null,null,null,""]
["Circuit 20",{"$f":"IF(ISBLANK(Circuits!X22),\" \",(Circuits!X22))","v":" "},{"$f":"IF(ISBLANK(Circuits!Y22),\" \",(Circuits!Y22))","v":" "},null,null," ",null,"SUR"," ",null,null,null,null,null,null,null,""]
[null,null,null,null,null,null,null,null,null,null,null,null,null,null,null,null,{"$f":"CONCATENATE(Q3,Q4,Q5,Q6,Q7,Q8,Q9,Q10,Q11,Q12,Q13,Q14,Q15,Q16,Q17,Q18,Q19,Q20,Q21,Q22)","v":""}]
[null,null,null,"TEMPS TOTAL",null,{"$f":"SUM(F3:F22)","v":"00:00:00"}]
[]
[null,null,null,"TEMPS MOYEN",null,{"$f":"IF(ISBLANK(D3),\" \",AVERAGE(F3:F22))","v":" "}]
[]
[null,null,null,"NB TOTAL BALISES",null,null,{"$f":"SUM(G3:G22)","v":0},"SUR",{"$f":"SUM(I3:I22)","v":0}]
[]
[null,null,null,{"$f":"COUNTA(D3:D22)","v":0},{"$f":"COUNTA(E3:E22)","v":0}]

{"sheet":"E12","index":16,"n_rows":30,"n_cols":17,"rows_kept":30,"cut":false,"hidden":false,"merged":[]}
[null,null,null,"EQUIPE ",12,null," ",null," ",{"$f":"NOW()","v":43688.614419444442}]
[null,"BALISES","NB","DEPART","ARRIVEE","TEMPS","NB Trouvées"]
["Circuit 1",{"$f":"IF(ISBLANK(Circuits!Z3),\" \",(Circuits!Z3))","v":" "},{"$f":"IF(ISBLANK(Circuits!AA3),\" \",(Circuits!AA3))","v":" "},null,null,{"$f":"IF(ISBLANK(E3),\" \",E3-D3)","v":" "},null,"SUR",{"$f":"IF(ISBLANK(D3),\" \",C3)","v":" "},null,null,null,null,null,null,null,{"$f":"IF(COUNTA(D3)=COUNTA(E3),\"\",B3)","v":""}]
["Circuit 2",{"$f":"IF(ISBLANK(Circuits!Z4),\" \",(Circuits!Z4))","v":" "},{"$f":"IF(ISBLANK(Circuits!AA4),\" \",(Circuits!AA4))","v":" "},null,null," ",null,"SUR",{"$f":"IF(ISBLANK(D4),\" \",C4)","v":" "},null,null,null,null,null,null,null,{"$f":"IF(COUNTA(D4)=COUNTA(E4),\"\",B4)","v":""}]
["Circuit 3",{"$f":"IF(ISBLANK(Circuits!Z5),\" \",(Circuits!Z5))","v":" "},{"$f":"IF(ISBLANK(Circuits!AA5),\" \",(Circuits!AA5))","v":" "},null,null," ",null,"SUR"," ",null,null,null,null,null,{"$f":"IF(ISBLANK('Liste classe'!E14),\" \",('Liste classe'!E14))","v":" "},null,""]
["Circuit 4",{"$f":"IF(ISBLANK(Circuits!Z6),\" \",(Circuits!Z6))","v":" "},{"$f":"IF(ISBLANK(Circuits!AA6),\" \",(Circuits!AA6))","v":" "},null,null," ",null,"SUR"," ",null,null,null,null,null,{"$f":"IF(ISBLANK('Liste classe'!F14),\" \",('Liste classe'!F14))","v":" "},null,""]
["Circuit 5",{"$f":"IF(ISBLANK(Circuits!Z7),\" \",(Circuits!Z7))","v":" "},{"$f":"IF(ISBLANK(Circuits!AA7),\" \",(Circuits!AA7))","v":" "},null,null," ",null,"SUR"," ",null,null,null,null,null,{"$f":"IF(ISBLANK('Liste classe'!G14),\" \",('Liste classe'!G14))","v":" "},null,""]
["Circuit 6",{"$f":"IF(ISBLANK(Circuits!Z8),\" \",(Circuits!Z8))","v":" "},{"$f":"IF(ISBLANK(Circuits!AA8),\" \",(Circuits!AA8))","v":" "},null,null," ",null,"SUR"," ",null,null,null,null,null,{"$f":"IF(ISBLANK('Liste classe'!H14),\" \",('Liste classe'!H14))","v":" "},null,""]
["Circuit 7",{"$f":"IF(ISBLANK(Circuits!Z9),\" \",(Circuits!Z9))","v":" "},{"$f":"IF(ISBLANK(Circuits!AA9),\" \",(Circuits!AA9))","v":" "},null,null," ",null,"SUR"," ",null,null,null,null,null,{"$f":"IF(ISBLANK('Liste classe'!I14),\" \",('Liste classe'!I14))","v":" "},null,""]
["Circuit 8",{"$f":"IF(ISBLANK(Circuits!Z10),\" \",(Circuits!Z10))","v":" "},{"$f":"IF(ISBLANK(Circuits!AA10),\" \",(Circuits!AA10))","v":" "},null,null," ",null,"SUR"," ",null,null,null,null,null,{"$f":"IF(ISBLANK('Liste classe'!J14),\" \",('Liste classe'!J14))","v":" "},null,""]
["Circuit 9",{"$f":"IF(ISBLANK(Circuits!Z11),\" \",(Circuits!Z11))","v":" "},{"$f":"IF(ISBLANK(Circuits!AA11),\" \",(Circuits!AA11))","v":" "},null,null," ",null,"SUR"," ",null,null,null,null,null,null,null,""]
["Circuit 10",{"$f":"IF(ISBLANK(Circuits!Z12),\" \",(Circuits!Z12))","v":" "},{"$f":"IF(ISBLANK(Circuits!AA12),\" \",(Circuits!AA12))","v":" "},null,null," ",null,"SUR"," ",null,null,null,null,null,null,null,""]
["Circuit 11",{"$f":"IF(ISBLANK(Circuits!Z13),\" \",(Circuits!Z13))","v":" "},{"$f":"IF(ISBLANK(Circuits!AA13),\" \",(Circuits!AA13))","v":" "},null,null," ",null,"SUR"," ",null,null,null,null,null,null,null,""]
["Circuit 12",{"$f":"IF(ISBLANK(Circuits!Z14),\" \",(Circuits!Z14))","v":" "},{"$f":"IF(ISBLANK(Circuits!AA14),\" \",(Circuits!AA14))","v":" "},null,null," ",null,"SUR"," ",null,null,null,null,null,null,null,""]
["Circuit 13",{"$f":"IF(ISBLANK(Circuits!Z15),\" \",(Circuits!Z15))","v":" "},{"$f":"IF(ISBLANK(Circuits!AA15),\" \",(Circuits!AA15))","v":" "},null,null," ",null,"SUR"," ",null,null,null,null,null,null,null,""]
["Circuit 14",{"$f":"IF(ISBLANK(Circuits!Z16),\" \",(Circuits!Z16))","v":" "},{"$f":"IF(ISBLANK(Circuits!AA16),\" \",(Circuits!AA16))","v":" "},null,null," ",null,"SUR"," ",null,null,null,null,null,null,null,""]
["Circuit 15",{"$f":"IF(ISBLANK(Circuits!Z17),\" \",(Circuits!Z17))","v":" "},{"$f":"IF(ISBLANK(Circuits!AA17),\" \",(Circuits!AA17))","v":" "},null,null," ",null,"SUR"," ",null,null,null,null,null,null,null,""]
["Circuit 16",{"$f":"IF(ISBLANK(Circuits!Z18),\" \",(Circuits!Z18))","v":" "},{"$f":"IF(ISBLANK(Circuits!AA18),\" \",(Circuits!AA18))","v":" "},null,null," ",null,"SUR"," ",null,null,null,null,null,null,null,""]
["Circuit 17",{"$f":"IF(ISBLANK(Circuits!Z19),\" \",(Circuits!Z19))","v":" "},{"$f":"IF(ISBLANK(Circuits!AA19),\" \",(Circuits!AA19))","v":" "},null,null," ",null,"SUR"," ",null,null,null,null,null,null,null,""]
["Circuit 18",{"$f":"IF(ISBLANK(Circuits!Z20),\" \",(Circuits!Z20))","v":" "},{"$f":"IF(ISBLANK(Circuits!AA20),\" \",(Circuits!AA20))","v":" "},null,null," ",null,"SUR"," ",null,null,null,null,null,null,null,""]
["Circuit 19",{"$f":"IF(ISBLANK(Circuits!Z21),\" \",(Circuits!Z21))","v":" "},{"$f":"IF(ISBLANK(Circuits!AA21),\" \",(Circuits!AA21))","v":" "},null,null," ",null,"SUR"," ",null,null,null,null,null,null,null,""]
["Circuit 20",{"$f":"IF(ISBLANK(Circuits!Z22),\" \",(Circuits!Z22))","v":" "},{"$f":"IF(ISBLANK(Circuits!AA22),\" \",(Circuits!AA22))","v":" "},null,null," ",null,"SUR"," ",null,null,null,null,null,null,null,""]
[null,null,null,null,null,null,null,null,null,null,null,null,null,null,null,null,{"$f":"CONCATENATE(Q3,Q4,Q5,Q6,Q7,Q8,Q9,Q10,Q11,Q12,Q13,Q14,Q15,Q16,Q17,Q18,Q19,Q20,Q21,Q22)","v":""}]
[null,null,null,"TEMPS TOTAL",null,{"$f":"SUM(F3:F22)","v":"00:00:00"}]
[]
[null,null,null,"TEMPS MOYEN",null,{"$f":"IF(ISBLANK(D3),\" \",AVERAGE(F3:F22))","v":" "}]
[]
[null,null,null,"NB TOTAL BALISES",null,null,{"$f":"SUM(G3:G22)","v":0},"SUR",{"$f":"SUM(I3:I22)","v":0}]
[]
[null,null,null,{"$f":"COUNTA(D3:D22)","v":0},{"$f":"COUNTA(E3:E22)","v":0}]

{"sheet":"E13","index":17,"n_rows":30,"n_cols":17,"rows_kept":30,"cut":false,"hidden":false,"merged":[]}
[null,null,null,"EQUIPE ",13,null," ",null," ",{"$f":"NOW()","v":43688.614419444442}]
[null,"BALISES","NB","DEPART","ARRIVEE","TEMPS","NB Trouvées"]
["Circuit 1",{"$f":"IF(ISBLANK(Circuits!AB3),\" \",(Circuits!AB3))","v":" "},{"$f":"IF(ISBLANK(Circuits!AC3),\" \",(Circuits!AC3))","v":" "},null,null,{"$f":"IF(ISBLANK(E3),\" \",E3-D3)","v":" "},null,"SUR",{"$f":"IF(ISBLANK(D3),\" \",C3)","v":" "},null,null,null,null,null,null,null,{"$f":"IF(COUNTA(D3)=COUNTA(E3),\"\",B3)","v":""}]
["Circuit 2",{"$f":"IF(ISBLANK(Circuits!AB4),\" \",(Circuits!AB4))","v":" "},{"$f":"IF(ISBLANK(Circuits!AC4),\" \",(Circuits!AC4))","v":" "},null,null," ",null,"SUR",{"$f":"IF(ISBLANK(D4),\" \",C4)","v":" "},null,null,null,null,null,null,null,{"$f":"IF(COUNTA(D4)=COUNTA(E4),\"\",B4)","v":""}]
["Circuit 3",{"$f":"IF(ISBLANK(Circuits!AB5),\" \",(Circuits!AB5))","v":" "},{"$f":"IF(ISBLANK(Circuits!AC5),\" \",(Circuits!AC5))","v":" "},null,null," ",null,"SUR"," ",null,null,null,null,null,{"$f":"IF(ISBLANK('Liste classe'!E15),\" \",('Liste classe'!E15))","v":" "},null,""]
["Circuit 4",{"$f":"IF(ISBLANK(Circuits!AB6),\" \",(Circuits!AB6))","v":" "},{"$f":"IF(ISBLANK(Circuits!AC6),\" \",(Circuits!AC6))","v":" "},null,null," ",null,"SUR"," ",null,null,null,null,null,{"$f":"IF(ISBLANK('Liste classe'!F15),\" \",('Liste classe'!F15))","v":" "},null,""]
["Circuit 5",{"$f":"IF(ISBLANK(Circuits!AB7),\" \",(Circuits!AB7))","v":" "},{"$f":"IF(ISBLANK(Circuits!AC7),\" \",(Circuits!AC7))","v":" "},null,null," ",null,"SUR"," ",null,null,null,null,null,{"$f":"IF(ISBLANK('Liste classe'!G15),\" \",('Liste classe'!G15))","v":" "},null,""]
["Circuit 6",{"$f":"IF(ISBLANK(Circuits!AB8),\" \",(Circuits!AB8))","v":" "},{"$f":"IF(ISBLANK(Circuits!AC8),\" \",(Circuits!AC8))","v":" "},null,null," ",null,"SUR"," ",null,null,null,null,null,{"$f":"IF(ISBLANK('Liste classe'!H15),\" \",('Liste classe'!H15))","v":" "},null,""]
["Circuit 7",{"$f":"IF(ISBLANK(Circuits!AB9),\" \",(Circuits!AB9))","v":" "},{"$f":"IF(ISBLANK(Circuits!AC9),\" \",(Circuits!AC9))","v":" "},null,null," ",null,"SUR"," ",null,null,null,null,null,{"$f":"IF(ISBLANK('Liste classe'!I15),\" \",('Liste classe'!I15))","v":" "},null,""]
["Circuit 8",{"$f":"IF(ISBLANK(Circuits!AB10),\" \",(Circuits!AB10))","v":" "},{"$f":"IF(ISBLANK(Circuits!AC10),\" \",(Circuits!AC10))","v":" "},null,null," ",null,"SUR"," ",null,null,null,null,null,{"$f":"IF(ISBLANK('Liste classe'!J15),\" \",('Liste classe'!J15))","v":" "},null,""]
["Circuit 9",{"$f":"IF(ISBLANK(Circuits!AB11),\" \",(Circuits!AB11))","v":" "},{"$f":"IF(ISBLANK(Circuits!AC11),\" \",(Circuits!AC11))","v":" "},null,null," ",null,"SUR"," ",null,null,null,null,null,null,null,""]
["Circuit 10",{"$f":"IF(ISBLANK(Circuits!AB12),\" \",(Circuits!AB12))","v":" "},{"$f":"IF(ISBLANK(Circuits!AC12),\" \",(Circuits!AC12))","v":" "},null,null," ",null,"SUR"," ",null,null,null,null,null,null,null,""]
["Circuit 11",{"$f":"IF(ISBLANK(Circuits!AB13),\" \",(Circuits!AB13))","v":" "},{"$f":"IF(ISBLANK(Circuits!AC13),\" \",(Circuits!AC13))","v":" "},null,null," ",null,"SUR"," ",null,null,null,null,null,null,null,""]
["Circuit 12",{"$f":"IF(ISBLANK(Circuits!AB14),\" \",(Circuits!AB14))","v":" "},{"$f":"IF(ISBLANK(Circuits!AC14),\" \",(Circuits!AC14))","v":" "},null,null," ",null,"SUR"," ",null,null,null,null,null,null,null,""]
["Circuit 13",{"$f":"IF(ISBLANK(Circuits!AB15),\" \",(Circuits!AB15))","v":" "},{"$f":"IF(ISBLANK(Circuits!AC15),\" \",(Circuits!AC15))","v":" "},null,null," ",null,"SUR"," ",null,null,null,null,null,null,null,""]
["Circuit 14",{"$f":"IF(ISBLANK(Circuits!AB16),\" \",(Circuits!AB16))","v":" "},{"$f":"IF(ISBLANK(Circuits!AC16),\" \",(Circuits!AC16))","v":" "},null,null," ",null,"SUR"," ",null,null,null,null,null,null,null,""]
["Circuit 15",{"$f":"IF(ISBLANK(Circuits!AB17),\" \",(Circuits!AB17))","v":" "},{"$f":"IF(ISBLANK(Circuits!AC17),\" \",(Circuits!AC17))","v":" "},null,null," ",null,"SUR"," ",null,null,null,null,null,null,null,""]
["Circuit 16",{"$f":"IF(ISBLANK(Circuits!AB18),\" \",(Circuits!AB18))","v":" "},{"$f":"IF(ISBLANK(Circuits!AC18),\" \",(Circuits!AC18))","v":" "},null,null," ",null,"SUR"," ",null,null,null,null,null,null,null,""]
["Circuit 17",{"$f":"IF(ISBLANK(Circuits!AB19),\" \",(Circuits!AB19))","v":" "},{"$f":"IF(ISBLANK(Circuits!AC19),\" \",(Circuits!AC19))","v":" "},null,null," ",null,"SUR"," ",null,null,null,null,null,null,null,""]
["Circuit 18",{"$f":"IF(ISBLANK(Circuits!AB20),\" \",(Circuits!AB20))","v":" "},{"$f":"IF(ISBLANK(Circuits!AC20),\" \",(Circuits!AC20))","v":" "},null,null," ",null,"SUR"," ",null,null,null,null,null,null,null,""]
["Circuit 19",{"$f":"IF(ISBLANK(Circuits!AB21),\" \",(Circuits!AB21))","v":" "},{"$f":"IF(ISBLANK(Circuits!AC21),\" \",(Circuits!AC21))","v":" "},null,null," ",null,"SUR"," ",null,null,null,null,null,null,null,""]
["Circuit 20",{"$f":"IF(ISBLANK(Circuits!AB22),\" \",(Circuits!AB22))","v":" "},{"$f":"IF(ISBLANK(Circuits!AC22),\" \",(Circuits!AC22))","v":" "},null,null," ",null,"SUR"," ",null,null,null,null,null,null,null,""]
[null,null,null,null,null,null,null,null,null,null,null,null,null,null,null,null,{"$f":"CONCATENATE(Q3,Q4,Q5,Q6,Q7,Q8,Q9,Q10,Q11,Q12,Q13,Q14,Q15,Q16,Q17,Q18,Q19,Q20,Q21,Q22)","v":""}]
[null,null,null,"TEMPS TOTAL",null,{"$f":"SUM(F3:F22)","v":"00:00:00"}]
[]
[null,null,null,"TEMPS MOYEN",null,{"$f":"IF(ISBLANK(D3),\" \",AVERAGE(F3:F22))","v":" "}]
[]
[null,null,null,"NB TOTAL BALISES",null,null,{"$f":"SUM(G3:G22)","v":0},"SUR",{"$f":"SUM(I3:I22)","v":0}]
[]
[null,null,null,{"$f":"COUNTA(D3:D22)","v":0},{"$f":"COUNTA(E3:E22)","v":0}]

{"sheet":"E14","index":18,"n_rows":30,"n_cols":17,"rows_kept":30,"cut":false,"hidden":false,"merged":[]}
[null,null,null,"EQUIPE ",14,null," ",null," ",{"$f":"NOW()","v":43688.614419444442}]
[null,"BALISES","NB","DEPART","ARRIVEE","TEMPS","NB Trouvées"]
["Circuit 1",{"$f":"IF(ISBLANK(Circuits!AD3),\" \",(Circuits!AD3))","v":" "},{"$f":"IF(ISBLANK(Circuits!AE3),\" \",(Circuits!AE3))","v":" "},null,null,{"$f":"IF(ISBLANK(E3),\" \",E3-D3)","v":" "},null,"SUR",{"$f":"IF(ISBLANK(D3),\" \",C3)","v":" "},null,null,null,null,null,null,null,{"$f":"IF(COUNTA(D3)=COUNTA(E3),\"\",B3)","v":""}]
["Circuit 2",{"$f":"IF(ISBLANK(Circuits!AD4),\" \",(Circuits!AD4))","v":" "},{"$f":"IF(ISBLANK(Circuits!AE4),\" \",(Circuits!AE4))","v":" "},null,null," ",null,"SUR",{"$f":"IF(ISBLANK(D4),\" \",C4)","v":" "},null,null,null,null,null,null,null,{"$f":"IF(COUNTA(D4)=COUNTA(E4),\"\",B4)","v":""}]
["Circuit 3",{"$f":"IF(ISBLANK(Circuits!AD5),\" \",(Circuits!AD5))","v":" "},{"$f":"IF(ISBLANK(Circuits!AE5),\" \",(Circuits!AE5))","v":" "},null,null," ",null,"SUR"," ",null,null,null,null,null,{"$f":"IF(ISBLANK('Liste classe'!E16),\" \",('Liste classe'!E16))","v":" "},null,""]
["Circuit 4",{"$f":"IF(ISBLANK(Circuits!AD6),\" \",(Circuits!AD6))","v":" "},{"$f":"IF(ISBLANK(Circuits!AE6),\" \",(Circuits!AE6))","v":" "},null,null," ",null,"SUR"," ",null,null,null,null,null,{"$f":"IF(ISBLANK('Liste classe'!F16),\" \",('Liste classe'!F16))","v":" "},null,""]
["Circuit 5",{"$f":"IF(ISBLANK(Circuits!AD7),\" \",(Circuits!AD7))","v":" "},{"$f":"IF(ISBLANK(Circuits!AE7),\" \",(Circuits!AE7))","v":" "},null,null," ",null,"SUR"," ",null,null,null,null,null,{"$f":"IF(ISBLANK('Liste classe'!G16),\" \",('Liste classe'!G16))","v":" "},null,""]
["Circuit 6",{"$f":"IF(ISBLANK(Circuits!AD8),\" \",(Circuits!AD8))","v":" "},{"$f":"IF(ISBLANK(Circuits!AE8),\" \",(Circuits!AE8))","v":" "},null,null," ",null,"SUR"," ",null,null,null,null,null,{"$f":"IF(ISBLANK('Liste classe'!H16),\" \",('Liste classe'!H16))","v":" "},null,""]
["Circuit 7",{"$f":"IF(ISBLANK(Circuits!AD9),\" \",(Circuits!AD9))","v":" "},{"$f":"IF(ISBLANK(Circuits!AE9),\" \",(Circuits!AE9))","v":" "},null,null," ",null,"SUR"," ",null,null,null,null,null,{"$f":"IF(ISBLANK('Liste classe'!I16),\" \",('Liste classe'!I16))","v":" "},null,""]
["Circuit 8",{"$f":"IF(ISBLANK(Circuits!AD10),\" \",(Circuits!AD10))","v":" "},{"$f":"IF(ISBLANK(Circuits!AE10),\" \",(Circuits!AE10))","v":" "},null,null," ",null,"SUR"," ",null,null,null,null,null,{"$f":"IF(ISBLANK('Liste classe'!J16),\" \",('Liste classe'!J16))","v":" "},null,""]
["Circuit 9",{"$f":"IF(ISBLANK(Circuits!AD11),\" \",(Circuits!AD11))","v":" "},{"$f":"IF(ISBLANK(Circuits!AE11),\" \",(Circuits!AE11))","v":" "},null,null," ",null,"SUR"," ",null,null,null,null,null,null,null,""]
["Circuit 10",{"$f":"IF(ISBLANK(Circuits!AD12),\" \",(Circuits!AD12))","v":" "},{"$f":"IF(ISBLANK(Circuits!AE12),\" \",(Circuits!AE12))","v":" "},null,null," ",null,"SUR"," ",null,null,null,null,null,null,null,""]
["Circuit 11",{"$f":"IF(ISBLANK(Circuits!AD13),\" \",(Circuits!AD13))","v":" "},{"$f":"IF(ISBLANK(Circuits!AE13),\" \",(Circuits!AE13))","v":" "},null,null," ",null,"SUR"," ",null,null,null,null,null,null,null,""]
["Circuit 12",{"$f":"IF(ISBLANK(Circuits!AD14),\" \",(Circuits!AD14))","v":" "},{"$f":"IF(ISBLANK(Circuits!AE14),\" \",(Circuits!AE14))","v":" "},null,null," ",null,"SUR"," ",null,null,null,null,null,null,null,""]
["Circuit 13",{"$f":"IF(ISBLANK(Circuits!AD15),\" \",(Circuits!AD15))","v":" "},{"$f":"IF(ISBLANK(Circuits!AE15),\" \",(Circuits!AE15))","v":" "},null,null," ",null,"SUR"," ",null,null,null,null,null,null,null,""]
["Circuit 14",{"$f":"IF(ISBLANK(Circuits!AD16),\" \",(Circuits!AD16))","v":" "},{"$f":"IF(ISBLANK(Circuits!AE16),\" \",(Circuits!AE16))","v":" "},null,null," ",null,"SUR"," ",null,null,null,null,null,null,null,""]
["Circuit 15",{"$f":"IF(ISBLANK(Circuits!AD17),\" \",(Circuits!AD17))","v":" "},{"$f":"IF(ISBLANK(Circuits!AE17),\" \",(Circuits!AE17))","v":" "},null,null," ",null,"SUR"," ",null,null,null,null,null,null,null,""]
["Circuit 16",{"$f":"IF(ISBLANK(Circuits!AD18),\" \",(Circuits!AD18))","v":" "},{"$f":"IF(ISBLANK(Circuits!AE18),\" \",(Circuits!AE18))","v":" "},null,null," ",null,"SUR"," ",null,null,null,null,null,null,null,""]
["Circuit 17",{"$f":"IF(ISBLANK(Circuits!AD19),\" \",(Circuits!AD19))","v":" "},{"$f":"IF(ISBLANK(Circuits!AE19),\" \",(Circuits!AE19))","v":" "},null,null," ",null,"SUR"," ",null,null,null,null,null,null,null,""]
["Circuit 18",{"$f":"IF(ISBLANK(Circuits!AD20),\" \",(Circuits!AD20))","v":" "},{"$f":"IF(ISBLANK(Circuits!AE20),\" \",(Circuits!AE20))","v":" "},null,null," ",null,"SUR"," ",null,null,null,null,null,null,null,""]
["Circuit 19",{"$f":"IF(ISBLANK(Circuits!AD21),\" \",(Circuits!AD21))","v":" "},{"$f":"IF(ISBLANK(Circuits!AE21),\" \",(Circuits!AE21))","v":" "},null,null," ",null,"SUR"," ",null,null,null,null,null,null,null,""]
["Circuit 20",{"$f":"IF(ISBLANK(Circuits!AD22),\" \",(Circuits!AD22))","v":" "},{"$f":"IF(ISBLANK(Circuits!AE22),\" \",(Circuits!AE22))","v":" "},null,null," ",null,"SUR"," ",null,null,null,null,null,null,null,""]
[null,null,null,null,null,null,null,null,null,null,null,null,null,null,null,null,{"$f":"CONCATENATE(Q3,Q4,Q5,Q6,Q7,Q8,Q9,Q10,Q11,Q12,Q13,Q14,Q15,Q16,Q17,Q18,Q19,Q20,Q21,Q22)","v":""}]
[null,null,null,"TEMPS TOTAL",null,{"$f":"SUM(F3:F22)","v":"00:00:00"}]
[]
[null,null,null,"TEMPS MOYEN",null,{"$f":"IF(ISBLANK(D3),\" \",AVERAGE(F3:F22))","v":" "}]
[]
[null,null,null,"NB TOTAL BALISES",null,null,{"$f":"SUM(G3:G22)","v":0},"SUR",{"$f":"SUM(I3:I22)","v":0}]
[]
[null,null,null,{"$f":"COUNTA(D3:D22)","v":0},{"$f":"COUNTA(E3:E22)","v":0}]

{"sheet":"E15","index":19,"n_rows":30,"n_cols":17,"rows_kept":30,"cut":false,"hidden":false,"merged":[]}
[null,null,null,"EQUIPE ",15,null," ",null," ",{"$f":"NOW()","v":43688.614419444442}]
[null,"BALISES","NB","DEPART","ARRIVEE","TEMPS","NB Trouvées"]
["Circuit 1",{"$f":"IF(ISBLANK(Circuits!AF3),\" \",(Circuits!AF3))","v":" "},{"$f":"IF(ISBLANK(Circuits!AG3),\" \",(Circuits!AG3))","v":" "},null,null,{"$f":"IF(ISBLANK(E3),\" \",E3-D3)","v":" "},null,"SUR",{"$f":"IF(ISBLANK(D3),\" \",C3)","v":" "},null,null,null,null,null,null,null,{"$f":"IF(COUNTA(D3)=COUNTA(E3),\"\",B3)","v":""}]
["Circuit 2",{"$f":"IF(ISBLANK(Circuits!AF4),\" \",(Circuits!AF4))","v":" "},{"$f":"IF(ISBLANK(Circuits!AG4),\" \",(Circuits!AG4))","v":" "},null,null," ",null,"SUR",{"$f":"IF(ISBLANK(D4),\" \",C4)","v":" "},null,null,null,null,null,null,null,{"$f":"IF(COUNTA(D4)=COUNTA(E4),\"\",B4)","v":""}]
["Circuit 3",{"$f":"IF(ISBLANK(Circuits!AF5),\" \",(Circuits!AF5))","v":" "},{"$f":"IF(ISBLANK(Circuits!AG5),\" \",(Circuits!AG5))","v":" "},null,null," ",null,"SUR"," ",null,null,null,null,null,{"$f":"IF(ISBLANK('Liste classe'!E17),\" \",('Liste classe'!E17))","v":" "},null,""]
["Circuit 4",{"$f":"IF(ISBLANK(Circuits!AF6),\" \",(Circuits!AF6))","v":" "},{"$f":"IF(ISBLANK(Circuits!AG6),\" \",(Circuits!AG6))","v":" "},null,null," ",null,"SUR"," ",null,null,null,null,null,{"$f":"IF(ISBLANK('Liste classe'!F17),\" \",('Liste classe'!F17))","v":" "},null,""]
["Circuit 5",{"$f":"IF(ISBLANK(Circuits!AF7),\" \",(Circuits!AF7))","v":" "},{"$f":"IF(ISBLANK(Circuits!AG7),\" \",(Circuits!AG7))","v":" "},null,null," ",null,"SUR"," ",null,null,null,null,null,{"$f":"IF(ISBLANK('Liste classe'!G17),\" \",('Liste classe'!G17))","v":" "},null,""]
["Circuit 6",{"$f":"IF(ISBLANK(Circuits!AF8),\" \",(Circuits!AF8))","v":" "},{"$f":"IF(ISBLANK(Circuits!AG8),\" \",(Circuits!AG8))","v":" "},null,null," ",null,"SUR"," ",null,null,null,null,null,{"$f":"IF(ISBLANK('Liste classe'!H17),\" \",('Liste classe'!H17))","v":" "},null,""]
["Circuit 7",{"$f":"IF(ISBLANK(Circuits!AF9),\" \",(Circuits!AF9))","v":" "},{"$f":"IF(ISBLANK(Circuits!AG9),\" \",(Circuits!AG9))","v":" "},null,null," ",null,"SUR"," ",null,null,null,null,null,{"$f":"IF(ISBLANK('Liste classe'!I17),\" \",('Liste classe'!I17))","v":" "},null,""]
["Circuit 8",{"$f":"IF(ISBLANK(Circuits!AF10),\" \",(Circuits!AF10))","v":" "},{"$f":"IF(ISBLANK(Circuits!AG10),\" \",(Circuits!AG10))","v":" "},null,null," ",null,"SUR"," ",null,null,null,null,null,{"$f":"IF(ISBLANK('Liste classe'!J17),\" \",('Liste classe'!J17))","v":" "},null,""]
["Circuit 9",{"$f":"IF(ISBLANK(Circuits!AF11),\" \",(Circuits!AF11))","v":" "},{"$f":"IF(ISBLANK(Circuits!AG11),\" \",(Circuits!AG11))","v":" "},null,null," ",null,"SUR"," ",null,null,null,null,null,null,null,""]
["Circuit 10",{"$f":"IF(ISBLANK(Circuits!AF12),\" \",(Circuits!AF12))","v":" "},{"$f":"IF(ISBLANK(Circuits!AG12),\" \",(Circuits!AG12))","v":" "},null,null," ",null,"SUR"," ",null,null,null,null,null,null,null,""]
["Circuit 11",{"$f":"IF(ISBLANK(Circuits!AF13),\" \",(Circuits!AF13))","v":" "},{"$f":"IF(ISBLANK(Circuits!AG13),\" \",(Circuits!AG13))","v":" "},null,null," ",null,"SUR"," ",null,null,null,null,null,null,null,""]
["Circuit 12",{"$f":"IF(ISBLANK(Circuits!AF14),\" \",(Circuits!AF14))","v":" "},{"$f":"IF(ISBLANK(Circuits!AG14),\" \",(Circuits!AG14))","v":" "},null,null," ",null,"SUR"," ",null,null,null,null,null,null,null,""]
["Circuit 13",{"$f":"IF(ISBLANK(Circuits!AF15),\" \",(Circuits!AF15))","v":" "},{"$f":"IF(ISBLANK(Circuits!AG15),\" \",(Circuits!AG15))","v":" "},null,null," ",null,"SUR"," ",null,null,null,null,null,null,null,""]
["Circuit 14",{"$f":"IF(ISBLANK(Circuits!AF16),\" \",(Circuits!AF16))","v":" "},{"$f":"IF(ISBLANK(Circuits!AG16),\" \",(Circuits!AG16))","v":" "},null,null," ",null,"SUR"," ",null,null,null,null,null,null,null,""]
["Circuit 15",{"$f":"IF(ISBLANK(Circuits!AF17),\" \",(Circuits!AF17))","v":" "},{"$f":"IF(ISBLANK(Circuits!AG17),\" \",(Circuits!AG17))","v":" "},null,null," ",null,"SUR"," ",null,null,null,null,null,null,null,""]
["Circuit 16",{"$f":"IF(ISBLANK(Circuits!AF18),\" \",(Circuits!AF18))","v":" "},{"$f":"IF(ISBLANK(Circuits!AG18),\" \",(Circuits!AG18))","v":" "},null,null," ",null,"SUR"," ",null,null,null,null,null,null,null,""]
["Circuit 17",{"$f":"IF(ISBLANK(Circuits!AF19),\" \",(Circuits!AF19))","v":" "},{"$f":"IF(ISBLANK(Circuits!AG19),\" \",(Circuits!AG19))","v":" "},null,null," ",null,"SUR"," ",null,null,null,null,null,null,null,""]
["Circuit 18",{"$f":"IF(ISBLANK(Circuits!AF20),\" \",(Circuits!AF20))","v":" "},{"$f":"IF(ISBLANK(Circuits!AG20),\" \",(Circuits!AG20))","v":" "},null,null," ",null,"SUR"," ",null,null,null,null,null,null,null,""]
["Circuit 19",{"$f":"IF(ISBLANK(Circuits!AF21),\" \",(Circuits!AF21))","v":" "},{"$f":"IF(ISBLANK(Circuits!AG21),\" \",(Circuits!AG21))","v":" "},null,null," ",null,"SUR"," ",null,null,null,null,null,null,null,""]
["Circuit 20",{"$f":"IF(ISBLANK(Circuits!AF22),\" \",(Circuits!AF22))","v":" "},{"$f":"IF(ISBLANK(Circuits!AG22),\" \",(Circuits!AG22))","v":" "},null,null," ",null,"SUR"," ",null,null,null,null,null,null,null,""]
[null,null,null,null,null,null,null,null,null,null,null,null,null,null,null,null,{"$f":"CONCATENATE(Q3,Q4,Q5,Q6,Q7,Q8,Q9,Q10,Q11,Q12,Q13,Q14,Q15,Q16,Q17,Q18,Q19,Q20,Q21,Q22)","v":""}]
[null,null,null,"TEMPS TOTAL",null,{"$f":"SUM(F3:F22)","v":"00:00:00"}]
[]
[null,null,null,"TEMPS MOYEN",null,{"$f":"IF(ISBLANK(D3),\" \",AVERAGE(F3:F22))","v":" "}]
[]
[null,null,null,"NB TOTAL BALISES",null,null,{"$f":"SUM(G3:G22)","v":0},"SUR",{"$f":"SUM(I3:I22)","v":0}]
[]
[null,null,null,{"$f":"COUNTA(D3:D22)","v":0},{"$f":"COUNTA(E3:E22)","v":0}]

{"sheet":"E16","index":20,"n_rows":30,"n_cols":17,"rows_kept":30,"cut":false,"hidden":false,"merged":[]}
[null,null,null,"EQUIPE ",16,null," ",null," ",{"$f":"NOW()","v":43688.614419444442}]
[null,"BALISES","NB","DEPART","ARRIVEE","TEMPS","NB Trouvées"]
["Circuit 1",{"$f":"IF(ISBLANK(Circuits!AH3),\" \",(Circuits!AH3))","v":" "},{"$f":"IF(ISBLANK(Circuits!AI3),\" \",(Circuits!AI3))","v":" "},null,null,{"$f":"IF(ISBLANK(E3),\" \",E3-D3)","v":" "},null,"SUR",{"$f":"IF(ISBLANK(D3),\" \",C3)","v":" "},null,null,null,null,null,null,null,{"$f":"IF(COUNTA(D3)=COUNTA(E3),\"\",B3)","v":""}]
["Circuit 2",{"$f":"IF(ISBLANK(Circuits!AH4),\" \",(Circuits!AH4))","v":" "},{"$f":"IF(ISBLANK(Circuits!AI4),\" \",(Circuits!AI4))","v":" "},null,null," ",null,"SUR",{"$f":"IF(ISBLANK(D4),\" \",C4)","v":" "},null,null,null,null,null,null,null,{"$f":"IF(COUNTA(D4)=COUNTA(E4),\"\",B4)","v":""}]
["Circuit 3",{"$f":"IF(ISBLANK(Circuits!AH5),\" \",(Circuits!AH5))","v":" "},{"$f":"IF(ISBLANK(Circuits!AI5),\" \",(Circuits!AI5))","v":" "},null,null," ",null,"SUR"," ",null,null,null,null,null,{"$f":"IF(ISBLANK('Liste classe'!E18),\" \",('Liste classe'!E18))","v":" "},null,""]
["Circuit 4",{"$f":"IF(ISBLANK(Circuits!AH6),\" \",(Circuits!AH6))","v":" "},{"$f":"IF(ISBLANK(Circuits!AI6),\" \",(Circuits!AI6))","v":" "},null,null," ",null,"SUR"," ",null,null,null,null,null,{"$f":"IF(ISBLANK('Liste classe'!F18),\" \",('Liste classe'!F18))","v":" "},null,""]
["Circuit 5",{"$f":"IF(ISBLANK(Circuits!AH7),\" \",(Circuits!AH7))","v":" "},{"$f":"IF(ISBLANK(Circuits!AI7),\" \",(Circuits!AI7))","v":" "},null,null," ",null,"SUR"," ",null,null,null,null,null,{"$f":"IF(ISBLANK('Liste classe'!G18),\" \",('Liste classe'!G18))","v":" "},null,""]
["Circuit 6",{"$f":"IF(ISBLANK(Circuits!AH8),\" \",(Circuits!AH8))","v":" "},{"$f":"IF(ISBLANK(Circuits!AI8),\" \",(Circuits!AI8))","v":" "},null,null," ",null,"SUR"," ",null,null,null,null,null,{"$f":"IF(ISBLANK('Liste classe'!H18),\" \",('Liste classe'!H18))","v":" "},null,""]
["Circuit 7",{"$f":"IF(ISBLANK(Circuits!AH9),\" \",(Circuits!AH9))","v":" "},{"$f":"IF(ISBLANK(Circuits!AI9),\" \",(Circuits!AI9))","v":" "},null,null," ",null,"SUR"," ",null,null,null,null,null,{"$f":"IF(ISBLANK('Liste classe'!I18),\" \",('Liste classe'!I18))","v":" "},null,""]
["Circuit 8",{"$f":"IF(ISBLANK(Circuits!AH10),\" \",(Circuits!AH10))","v":" "},{"$f":"IF(ISBLANK(Circuits!AI10),\" \",(Circuits!AI10))","v":" "},null,null," ",null,"SUR"," ",null,null,null,null,null,{"$f":"IF(ISBLANK('Liste classe'!J18),\" \",('Liste classe'!J18))","v":" "},null,""]
["Circuit 9",{"$f":"IF(ISBLANK(Circuits!AH11),\" \",(Circuits!AH11))","v":" "},{"$f":"IF(ISBLANK(Circuits!AI11),\" \",(Circuits!AI11))","v":" "},null,null," ",null,"SUR"," ",null,null,null,null,null,null,null,""]
["Circuit 10",{"$f":"IF(ISBLANK(Circuits!AH12),\" \",(Circuits!AH12))","v":" "},{"$f":"IF(ISBLANK(Circuits!AI12),\" \",(Circuits!AI12))","v":" "},null,null," ",null,"SUR"," ",null,null,null,null,null,null,null,""]
["Circuit 11",{"$f":"IF(ISBLANK(Circuits!AH13),\" \",(Circuits!AH13))","v":" "},{"$f":"IF(ISBLANK(Circuits!AI13),\" \",(Circuits!AI13))","v":" "},null,null," ",null,"SUR"," ",null,null,null,null,null,null,null,""]
["Circuit 12",{"$f":"IF(ISBLANK(Circuits!AH14),\" \",(Circuits!AH14))","v":" "},{"$f":"IF(ISBLANK(Circuits!AI14),\" \",(Circuits!AI14))","v":" "},null,null," ",null,"SUR"," ",null,null,null,null,null,null,null,""]
["Circuit 13",{"$f":"IF(ISBLANK(Circuits!AH15),\" \",(Circuits!AH15))","v":" "},{"$f":"IF(ISBLANK(Circuits!AI15),\" \",(Circuits!AI15))","v":" "},null,null," ",null,"SUR"," ",null,null,null,null,null,null,null,""]
["Circuit 14",{"$f":"IF(ISBLANK(Circuits!AH16),\" \",(Circuits!AH16))","v":" "},{"$f":"IF(ISBLANK(Circuits!AI16),\" \",(Circuits!AI16))","v":" "},null,null," ",null,"SUR"," ",null,null,null,null,null,null,null,""]
["Circuit 15",{"$f":"IF(ISBLANK(Circuits!AH17),\" \",(Circuits!AH17))","v":" "},{"$f":"IF(ISBLANK(Circuits!AI17),\" \",(Circuits!AI17))","v":" "},null,null," ",null,"SUR"," ",null,null,null,null,null,null,null,""]
["Circuit 16",{"$f":"IF(ISBLANK(Circuits!AH18),\" \",(Circuits!AH18))","v":" "},{"$f":"IF(ISBLANK(Circuits!AI18),\" \",(Circuits!AI18))","v":" "},null,null," ",null,"SUR"," ",null,null,null,null,null,null,null,""]
["Circuit 17",{"$f":"IF(ISBLANK(Circuits!AH19),\" \",(Circuits!AH19))","v":" "},{"$f":"IF(ISBLANK(Circuits!AI19),\" \",(Circuits!AI19))","v":" "},null,null," ",null,"SUR"," ",null,null,null,null,null,null,null,""]
["Circuit 18",{"$f":"IF(ISBLANK(Circuits!AH20),\" \",(Circuits!AH20))","v":" "},{"$f":"IF(ISBLANK(Circuits!AI20),\" \",(Circuits!AI20))","v":" "},null,null," ",null,"SUR"," ",null,null,null,null,null,null,null,""]
["Circuit 19",{"$f":"IF(ISBLANK(Circuits!AH21),\" \",(Circuits!AH21))","v":" "},{"$f":"IF(ISBLANK(Circuits!AI21),\" \",(Circuits!AI21))","v":" "},null,null," ",null,"SUR"," ",null,null,null,null,null,null,null,""]
["Circuit 20",{"$f":"IF(ISBLANK(Circuits!AH22),\" \",(Circuits!AH22))","v":" "},{"$f":"IF(ISBLANK(Circuits!AI22),\" \",(Circuits!AI22))","v":" "},null,null," ",null,"SUR"," ",null,null,null,null,null,null,null,""]
[null,null,null,null,null,null,null,null,null,null,null,null,null,null,null,null,{"$f":"CONCATENATE(Q3,Q4,Q5,Q6,Q7,Q8,Q9,Q10,Q11,Q12,Q13,Q14,Q15,Q16,Q17,Q18,Q19,Q20,Q21,Q22)","v":""}]
[null,null,null,"TEMPS TOTAL",null,{"$f":"SUM(F3:F22)","v":"00:00:00"}]
[]
[null,null,null,"TEMPS MOYEN",null,{"$f":"IF(ISBLANK(D3),\" \",AVERAGE(F3:F22))","v":" "}]
[]
[null,null,null,"NB TOTAL BALISES",null,null,{"$f":"SUM(G3:G22)","v":0},"SUR",{"$f":"SUM(I3:I22)","v":0}]
[]
[null,null,null,{"$f":"COUNTA(D3:D22)","v":0},{"$f":"COUNTA(E3:E22)","v":0}]

{"sheet":"E17","index":21,"n_rows":30,"n_cols":17,"rows_kept":30,"cut":false,"hidden":false,"merged":[]}
[null,null,null,"EQUIPE ",17,null," ",null," ",{"$f":"NOW()","v":43688.614419444442}]
[null,"BALISES","NB","DEPART","ARRIVEE","TEMPS","NB Trouvées"]
["Circuit 1",{"$f":"IF(ISBLANK(Circuits!AJ3),\" \",(Circuits!AJ3))","v":" "},{"$f":"IF(ISBLANK(Circuits!AK3),\" \",(Circuits!AK3))","v":" "},null,null,{"$f":"IF(ISBLANK(E3),\" \",E3-D3)","v":" "},null,"SUR",{"$f":"IF(ISBLANK(D3),\" \",C3)","v":" "},null,null,null,null,null,null,null,{"$f":"IF(COUNTA(D3)=COUNTA(E3),\"\",B3)","v":""}]
["Circuit 2",{"$f":"IF(ISBLANK(Circuits!AJ4),\" \",(Circuits!AJ4))","v":" "},{"$f":"IF(ISBLANK(Circuits!AK4),\" \",(Circuits!AK4))","v":" "},null,null," ",null,"SUR",{"$f":"IF(ISBLANK(D4),\" \",C4)","v":" "},null,null,null,null,null,null,null,{"$f":"IF(COUNTA(D4)=COUNTA(E4),\"\",B4)","v":""}]
["Circuit 3",{"$f":"IF(ISBLANK(Circuits!AJ5),\" \",(Circuits!AJ5))","v":" "},{"$f":"IF(ISBLANK(Circuits!AK5),\" \",(Circuits!AK5))","v":" "},null,null," ",null,"SUR"," ",null,null,null,null,null,{"$f":"IF(ISBLANK('Liste classe'!E19),\" \",('Liste classe'!E19))","v":" "},null,""]
["Circuit 4",{"$f":"IF(ISBLANK(Circuits!AJ6),\" \",(Circuits!AJ6))","v":" "},{"$f":"IF(ISBLANK(Circuits!AK6),\" \",(Circuits!AK6))","v":" "},null,null," ",null,"SUR"," ",null,null,null,null,null,{"$f":"IF(ISBLANK('Liste classe'!F19),\" \",('Liste classe'!F19))","v":" "},null,""]
["Circuit 5",{"$f":"IF(ISBLANK(Circuits!AJ7),\" \",(Circuits!AJ7))","v":" "},{"$f":"IF(ISBLANK(Circuits!AK7),\" \",(Circuits!AK7))","v":" "},null,null," ",null,"SUR"," ",null,null,null,null,null,{"$f":"IF(ISBLANK('Liste classe'!G19),\" \",('Liste classe'!G19))","v":" "},null,""]
["Circuit 6",{"$f":"IF(ISBLANK(Circuits!AJ8),\" \",(Circuits!AJ8))","v":" "},{"$f":"IF(ISBLANK(Circuits!AK8),\" \",(Circuits!AK8))","v":" "},null,null," ",null,"SUR"," ",null,null,null,null,null,{"$f":"IF(ISBLANK('Liste classe'!H19),\" \",('Liste classe'!H19))","v":" "},null,""]
["Circuit 7",{"$f":"IF(ISBLANK(Circuits!AJ9),\" \",(Circuits!AJ9))","v":" "},{"$f":"IF(ISBLANK(Circuits!AK9),\" \",(Circuits!AK9))","v":" "},null,null," ",null,"SUR"," ",null,null,null,null,null,{"$f":"IF(ISBLANK('Liste classe'!I19),\" \",('Liste classe'!I19))","v":" "},null,""]
["Circuit 8",{"$f":"IF(ISBLANK(Circuits!AJ10),\" \",(Circuits!AJ10))","v":" "},{"$f":"IF(ISBLANK(Circuits!AK10),\" \",(Circuits!AK10))","v":" "},null,null," ",null,"SUR"," ",null,null,null,null,null,{"$f":"IF(ISBLANK('Liste classe'!J19),\" \",('Liste classe'!J19))","v":" "},null,""]
["Circuit 9",{"$f":"IF(ISBLANK(Circuits!AJ11),\" \",(Circuits!AJ11))","v":" "},{"$f":"IF(ISBLANK(Circuits!AK11),\" \",(Circuits!AK11))","v":" "},null,null," ",null,"SUR"," ",null,null,null,null,null,null,null,""]
["Circuit 10",{"$f":"IF(ISBLANK(Circuits!AJ12),\" \",(Circuits!AJ12))","v":" "},{"$f":"IF(ISBLANK(Circuits!AK12),\" \",(Circuits!AK12))","v":" "},null,null," ",null,"SUR"," ",null,null,null,null,null,null,null,""]
["Circuit 11",{"$f":"IF(ISBLANK(Circuits!AJ13),\" \",(Circuits!AJ13))","v":" "},{"$f":"IF(ISBLANK(Circuits!AK13),\" \",(Circuits!AK13))","v":" "},null,null," ",null,"SUR"," ",null,null,null,null,null,null,null,""]
["Circuit 12",{"$f":"IF(ISBLANK(Circuits!AJ14),\" \",(Circuits!AJ14))","v":" "},{"$f":"IF(ISBLANK(Circuits!AK14),\" \",(Circuits!AK14))","v":" "},null,null," ",null,"SUR"," ",null,null,null,null,null,null,null,""]
["Circuit 13",{"$f":"IF(ISBLANK(Circuits!AJ15),\" \",(Circuits!AJ15))","v":" "},{"$f":"IF(ISBLANK(Circuits!AK15),\" \",(Circuits!AK15))","v":" "},null,null," ",null,"SUR"," ",null,null,null,null,null,null,null,""]
["Circuit 14",{"$f":"IF(ISBLANK(Circuits!AJ16),\" \",(Circuits!AJ16))","v":" "},{"$f":"IF(ISBLANK(Circuits!AK16),\" \",(Circuits!AK16))","v":" "},null,null," ",null,"SUR"," ",null,null,null,null,null,null,null,""]
["Circuit 15",{"$f":"IF(ISBLANK(Circuits!AJ17),\" \",(Circuits!AJ17))","v":" "},{"$f":"IF(ISBLANK(Circuits!AK17),\" \",(Circuits!AK17))","v":" "},null,null," ",null,"SUR"," ",null,null,null,null,null,null,null,""]
["Circuit 16",{"$f":"IF(ISBLANK(Circuits!AJ18),\" \",(Circuits!AJ18))","v":" "},{"$f":"IF(ISBLANK(Circuits!AK18),\" \",(Circuits!AK18))","v":" "},null,null," ",null,"SUR"," ",null,null,null,null,null,null,null,""]
["Circuit 17",{"$f":"IF(ISBLANK(Circuits!AJ19),\" \",(Circuits!AJ19))","v":" "},{"$f":"IF(ISBLANK(Circuits!AK19),\" \",(Circuits!AK19))","v":" "},null,null," ",null,"SUR"," ",null,null,null,null,null,null,null,""]
["Circuit 18",{"$f":"IF(ISBLANK(Circuits!AJ20),\" \",(Circuits!AJ20))","v":" "},{"$f":"IF(ISBLANK(Circuits!AK20),\" \",(Circuits!AK20))","v":" "},null,null," ",null,"SUR"," ",null,null,null,null,null,null,null,""]
["Circuit 19",{"$f":"IF(ISBLANK(Circuits!AJ21),\" \",(Circuits!AJ21))","v":" "},{"$f":"IF(ISBLANK(Circuits!AK21),\" \",(Circuits!AK21))","v":" "},null,null," ",null,"SUR"," ",null,null,null,null,null,null,null,""]
["Circuit 20",{"$f":"IF(ISBLANK(Circuits!AJ22),\" \",(Circuits!AJ22))","v":" "},{"$f":"IF(ISBLANK(Circuits!AK22),\" \",(Circuits!AK22))","v":" "},null,null," ",null,"SUR"," ",null,null,null,null,null,null,null,""]
[null,null,null,null,null,null,null,null,null,null,null,null,null,null,null,null,{"$f":"CONCATENATE(Q3,Q4,Q5,Q6,Q7,Q8,Q9,Q10,Q11,Q12,Q13,Q14,Q15,Q16,Q17,Q18,Q19,Q20,Q21,Q22)","v":""}]
[null,null,null,"TEMPS TOTAL",null,{"$f":"SUM(F3:F22)","v":"00:00:00"}]
[]
[null,null,null,"TEMPS MOYEN",null,{"$f":"IF(ISBLANK(D3),\" \",AVERAGE(F3:F22))","v":" "}]
[]
[null,null,null,"NB TOTAL BALISES",null,null,{"$f":"SUM(G3:G22)","v":0},"SUR",{"$f":"SUM(I3:I22)","v":0}]
[]
[null,null,null,{"$f":"COUNTA(D3:D22)","v":0},{"$f":"COUNTA(E3:E22)","v":0}]

{"sheet":"E18","index":22,"n_rows":30,"n_cols":17,"rows_kept":30,"cut":false,"hidden":false,"merged":[]}
[null,null,null,"EQUIPE ",18,null," ",null," ",{"$f":"NOW()","v":43688.614419444442}]
[null,"BALISES","NB","DEPART","ARRIVEE","TEMPS","NB Trouvées"]
["Circuit 1",{"$f":"IF(ISBLANK(Circuits!AL3),\" \",(Circuits!AL3))","v":" "},{"$f":"IF(ISBLANK(Circuits!AM3),\" \",(Circuits!AM3))","v":" "},null,null,{"$f":"IF(ISBLANK(E3),\" \",E3-D3)","v":" "},null,"SUR",{"$f":"IF(ISBLANK(D3),\" \",C3)","v":" "},null,null,null,null,null,null,null,{"$f":"IF(COUNTA(D3)=COUNTA(E3),\"\",B3)","v":""}]
["Circuit 2",{"$f":"IF(ISBLANK(Circuits!AL4),\" \",(Circuits!AL4))","v":" "},{"$f":"IF(ISBLANK(Circuits!AM4),\" \",(Circuits!AM4))","v":" "},null,null," ",null,"SUR",{"$f":"IF(ISBLANK(D4),\" \",C4)","v":" "},null,null,null,null,null,null,null,{"$f":"IF(COUNTA(D4)=COUNTA(E4),\"\",B4)","v":""}]
["Circuit 3",{"$f":"IF(ISBLANK(Circuits!AL5),\" \",(Circuits!AL5))","v":" "},{"$f":"IF(ISBLANK(Circuits!AM5),\" \",(Circuits!AM5))","v":" "},null,null," ",null,"SUR"," ",null,null,null,null,null,{"$f":"IF(ISBLANK('Liste classe'!E20),\" \",('Liste classe'!E20))","v":" "},null,""]
["Circuit 4",{"$f":"IF(ISBLANK(Circuits!AL6),\" \",(Circuits!AL6))","v":" "},{"$f":"IF(ISBLANK(Circuits!AM6),\" \",(Circuits!AM6))","v":" "},null,null," ",null,"SUR"," ",null,null,null,null,null,{"$f":"IF(ISBLANK('Liste classe'!F20),\" \",('Liste classe'!F20))","v":" "},null,""]
["Circuit 5",{"$f":"IF(ISBLANK(Circuits!AL7),\" \",(Circuits!AL7))","v":" "},{"$f":"IF(ISBLANK(Circuits!AM7),\" \",(Circuits!AM7))","v":" "},null,null," ",null,"SUR"," ",null,null,null,null,null,{"$f":"IF(ISBLANK('Liste classe'!G20),\" \",('Liste classe'!G20))","v":" "},null,""]
["Circuit 6",{"$f":"IF(ISBLANK(Circuits!AL8),\" \",(Circuits!AL8))","v":" "},{"$f":"IF(ISBLANK(Circuits!AM8),\" \",(Circuits!AM8))","v":" "},null,null," ",null,"SUR"," ",null,null,null,null,null,{"$f":"IF(ISBLANK('Liste classe'!H20),\" \",('Liste classe'!H20))","v":" "},null,""]
["Circuit 7",{"$f":"IF(ISBLANK(Circuits!AL9),\" \",(Circuits!AL9))","v":" "},{"$f":"IF(ISBLANK(Circuits!AM9),\" \",(Circuits!AM9))","v":" "},null,null," ",null,"SUR"," ",null,null,null,null,null,{"$f":"IF(ISBLANK('Liste classe'!I20),\" \",('Liste classe'!I20))","v":" "},null,""]
["Circuit 8",{"$f":"IF(ISBLANK(Circuits!AL10),\" \",(Circuits!AL10))","v":" "},{"$f":"IF(ISBLANK(Circuits!AM10),\" \",(Circuits!AM10))","v":" "},null,null," ",null,"SUR"," ",null,null,null,null,null,{"$f":"IF(ISBLANK('Liste classe'!J20),\" \",('Liste classe'!J20))","v":" "},null,""]
["Circuit 9",{"$f":"IF(ISBLANK(Circuits!AL11),\" \",(Circuits!AL11))","v":" "},{"$f":"IF(ISBLANK(Circuits!AM11),\" \",(Circuits!AM11))","v":" "},null,null," ",null,"SUR"," ",null,null,null,null,null,null,null,""]
["Circuit 10",{"$f":"IF(ISBLANK(Circuits!AL12),\" \",(Circuits!AL12))","v":" "},{"$f":"IF(ISBLANK(Circuits!AM12),\" \",(Circuits!AM12))","v":" "},null,null," ",null,"SUR"," ",null,null,null,null,null,null,null,""]
["Circuit 11",{"$f":"IF(ISBLANK(Circuits!AL13),\" \",(Circuits!AL13))","v":" "},{"$f":"IF(ISBLANK(Circuits!AM13),\" \",(Circuits!AM13))","v":" "},null,null," ",null,"SUR"," ",null,null,null,null,null,null,null,""]
["Circuit 12",{"$f":"IF(ISBLANK(Circuits!AL14),\" \",(Circuits!AL14))","v":" "},{"$f":"IF(ISBLANK(Circuits!AM14),\" \",(Circuits!AM14))","v":" "},null,null," ",null,"SUR"," ",null,null,null,null,null,null,null,""]
["Circuit 13",{"$f":"IF(ISBLANK(Circuits!AL15),\" \",(Circuits!AL15))","v":" "},{"$f":"IF(ISBLANK(Circuits!AM15),\" \",(Circuits!AM15))","v":" "},null,null," ",null,"SUR"," ",null,null,null,null,null,null,null,""]
["Circuit 14",{"$f":"IF(ISBLANK(Circuits!AL16),\" \",(Circuits!AL16))","v":" "},{"$f":"IF(ISBLANK(Circuits!AM16),\" \",(Circuits!AM16))","v":" "},null,null," ",null,"SUR"," ",null,null,null,null,null,null,null,""]
["Circuit 15",{"$f":"IF(ISBLANK(Circuits!AL17),\" \",(Circuits!AL17))","v":" "},{"$f":"IF(ISBLANK(Circuits!AM17),\" \",(Circuits!AM17))","v":" "},null,null," ",null,"SUR"," ",null,null,null,null,null,null,null,""]
["Circuit 16",{"$f":"IF(ISBLANK(Circuits!AL18),\" \",(Circuits!AL18))","v":" "},{"$f":"IF(ISBLANK(Circuits!AM18),\" \",(Circuits!AM18))","v":" "},null,null," ",null,"SUR"," ",null,null,null,null,null,null,null,""]
["Circuit 17",{"$f":"IF(ISBLANK(Circuits!AL19),\" \",(Circuits!AL19))","v":" "},{"$f":"IF(ISBLANK(Circuits!AM19),\" \",(Circuits!AM19))","v":" "},null,null," ",null,"SUR"," ",null,null,null,null,null,null,null,""]
["Circuit 18",{"$f":"IF(ISBLANK(Circuits!AL20),\" \",(Circuits!AL20))","v":" "},{"$f":"IF(ISBLANK(Circuits!AM20),\" \",(Circuits!AM20))","v":" "},null,null," ",null,"SUR"," ",null,null,null,null,null,null,null,""]
["Circuit 19",{"$f":"IF(ISBLANK(Circuits!AL21),\" \",(Circuits!AL21))","v":" "},{"$f":"IF(ISBLANK(Circuits!AM21),\" \",(Circuits!AM21))","v":" "},null,null," ",null,"SUR"," ",null,null,null,null,null,null,null,""]
["Circuit 20",{"$f":"IF(ISBLANK(Circuits!AL22),\" \",(Circuits!AL22))","v":" "},{"$f":"IF(ISBLANK(Circuits!AM22),\" \",(Circuits!AM22))","v":" "},null,null," ",null,"SUR"," ",null,null,null,null,null,null,null,""]
[null,null,null,null,null,null,null,null,null,null,null,null,null,null,null,null,{"$f":"CONCATENATE(Q3,Q4,Q5,Q6,Q7,Q8,Q9,Q10,Q11,Q12,Q13,Q14,Q15,Q16,Q17,Q18,Q19,Q20,Q21,Q22)","v":""}]
[null,null,null,"TEMPS TOTAL",null,{"$f":"SUM(F3:F22)","v":"00:00:00"}]
[]
[null,null,null,"TEMPS MOYEN",null,{"$f":"IF(ISBLANK(D3),\" \",AVERAGE(F3:F22))","v":" "}]
[]
[null,null,null,"NB TOTAL BALISES",null,null,{"$f":"SUM(G3:G22)","v":0},"SUR",{"$f":"SUM(I3:I22)","v":0}]
[]
[null,null,null,{"$f":"COUNTA(D3:D22)","v":0},{"$f":"COUNTA(E3:E22)","v":0}]

{"sheet":"E19","index":23,"n_rows":30,"n_cols":17,"rows_kept":30,"cut":false,"hidden":false,"merged":[]}
[null,null,null,"EQUIPE ",19,null," ",null," ",{"$f":"NOW()","v":43688.614419444442}]
[null,"BALISES","NB","DEPART","ARRIVEE","TEMPS","NB Trouvées"]
["Circuit 1",{"$f":"IF(ISBLANK(Circuits!AN3),\" \",(Circuits!AN3))","v":" "},{"$f":"IF(ISBLANK(Circuits!AO3),\" \",(Circuits!AO3))","v":" "},null,null,{"$f":"IF(ISBLANK(E3),\" \",E3-D3)","v":" "},null,"SUR",{"$f":"IF(ISBLANK(D3),\" \",C3)","v":" "},null,null,null,null,null,null,null,{"$f":"IF(COUNTA(D3)=COUNTA(E3),\"\",B3)","v":""}]
["Circuit 2",{"$f":"IF(ISBLANK(Circuits!AN4),\" \",(Circuits!AN4))","v":" "},{"$f":"IF(ISBLANK(Circuits!AO4),\" \",(Circuits!AO4))","v":" "},null,null," ",null,"SUR",{"$f":"IF(ISBLANK(D4),\" \",C4)","v":" "},null,null,null,null,null,null,null,{"$f":"IF(COUNTA(D4)=COUNTA(E4),\"\",B4)","v":""}]
["Circuit 3",{"$f":"IF(ISBLANK(Circuits!AN5),\" \",(Circuits!AN5))","v":" "},{"$f":"IF(ISBLANK(Circuits!AO5),\" \",(Circuits!AO5))","v":" "},null,null," ",null,"SUR"," ",null,null,null,null,null,{"$f":"IF(ISBLANK('Liste classe'!E21),\" \",('Liste classe'!E21))","v":" "},null,""]
["Circuit 4",{"$f":"IF(ISBLANK(Circuits!AN6),\" \",(Circuits!AN6))","v":" "},{"$f":"IF(ISBLANK(Circuits!AO6),\" \",(Circuits!AO6))","v":" "},null,null," ",null,"SUR"," ",null,null,null,null,null,{"$f":"IF(ISBLANK('Liste classe'!F21),\" \",('Liste classe'!F21))","v":" "},null,""]
["Circuit 5",{"$f":"IF(ISBLANK(Circuits!AN7),\" \",(Circuits!AN7))","v":" "},{"$f":"IF(ISBLANK(Circuits!AO7),\" \",(Circuits!AO7))","v":" "},null,null," ",null,"SUR"," ",null,null,null,null,null,{"$f":"IF(ISBLANK('Liste classe'!G21),\" \",('Liste classe'!G21))","v":" "},null,""]
["Circuit 6",{"$f":"IF(ISBLANK(Circuits!AN8),\" \",(Circuits!AN8))","v":" "},{"$f":"IF(ISBLANK(Circuits!AO8),\" \",(Circuits!AO8))","v":" "},null,null," ",null,"SUR"," ",null,null,null,null,null,{"$f":"IF(ISBLANK('Liste classe'!H21),\" \",('Liste classe'!H21))","v":" "},null,""]
["Circuit 7",{"$f":"IF(ISBLANK(Circuits!AN9),\" \",(Circuits!AN9))","v":" "},{"$f":"IF(ISBLANK(Circuits!AO9),\" \",(Circuits!AO9))","v":" "},null,null," ",null,"SUR"," ",null,null,null,null,null,{"$f":"IF(ISBLANK('Liste classe'!I21),\" \",('Liste classe'!I21))","v":" "},null,""]
["Circuit 8",{"$f":"IF(ISBLANK(Circuits!AN10),\" \",(Circuits!AN10))","v":" "},{"$f":"IF(ISBLANK(Circuits!AO10),\" \",(Circuits!AO10))","v":" "},null,null," ",null,"SUR"," ",null,null,null,null,null,{"$f":"IF(ISBLANK('Liste classe'!J21),\" \",('Liste classe'!J21))","v":" "},null,""]
["Circuit 9",{"$f":"IF(ISBLANK(Circuits!AN11),\" \",(Circuits!AN11))","v":" "},{"$f":"IF(ISBLANK(Circuits!AO11),\" \",(Circuits!AO11))","v":" "},null,null," ",null,"SUR"," ",null,null,null,null,null,null,null,""]
["Circuit 10",{"$f":"IF(ISBLANK(Circuits!AN12),\" \",(Circuits!AN12))","v":" "},{"$f":"IF(ISBLANK(Circuits!AO12),\" \",(Circuits!AO12))","v":" "},null,null," ",null,"SUR"," ",null,null,null,null,null,null,null,""]
["Circuit 11",{"$f":"IF(ISBLANK(Circuits!AN13),\" \",(Circuits!AN13))","v":" "},{"$f":"IF(ISBLANK(Circuits!AO13),\" \",(Circuits!AO13))","v":" "},null,null," ",null,"SUR"," ",null,null,null,null,null,null,null,""]
["Circuit 12",{"$f":"IF(ISBLANK(Circuits!AN14),\" \",(Circuits!AN14))","v":" "},{"$f":"IF(ISBLANK(Circuits!AO14),\" \",(Circuits!AO14))","v":" "},null,null," ",null,"SUR"," ",null,null,null,null,null,null,null,""]
["Circuit 13",{"$f":"IF(ISBLANK(Circuits!AN15),\" \",(Circuits!AN15))","v":" "},{"$f":"IF(ISBLANK(Circuits!AO15),\" \",(Circuits!AO15))","v":" "},null,null," ",null,"SUR"," ",null,null,null,null,null,null,null,""]
["Circuit 14",{"$f":"IF(ISBLANK(Circuits!AN16),\" \",(Circuits!AN16))","v":" "},{"$f":"IF(ISBLANK(Circuits!AO16),\" \",(Circuits!AO16))","v":" "},null,null," ",null,"SUR"," ",null,null,null,null,null,null,null,""]
["Circuit 15",{"$f":"IF(ISBLANK(Circuits!AN17),\" \",(Circuits!AN17))","v":" "},{"$f":"IF(ISBLANK(Circuits!AO17),\" \",(Circuits!AO17))","v":" "},null,null," ",null,"SUR"," ",null,null,null,null,null,null,null,""]
["Circuit 16",{"$f":"IF(ISBLANK(Circuits!AN18),\" \",(Circuits!AN18))","v":" "},{"$f":"IF(ISBLANK(Circuits!AO18),\" \",(Circuits!AO18))","v":" "},null,null," ",null,"SUR"," ",null,null,null,null,null,null,null,""]
["Circuit 17",{"$f":"IF(ISBLANK(Circuits!AN19),\" \",(Circuits!AN19))","v":" "},{"$f":"IF(ISBLANK(Circuits!AO19),\" \",(Circuits!AO19))","v":" "},null,null," ",null,"SUR"," ",null,null,null,null,null,null,null,""]
["Circuit 18",{"$f":"IF(ISBLANK(Circuits!AN20),\" \",(Circuits!AN20))","v":" "},{"$f":"IF(ISBLANK(Circuits!AO20),\" \",(Circuits!AO20))","v":" "},null,null," ",null,"SUR"," ",null,null,null,null,null,null,null,""]
["Circuit 19",{"$f":"IF(ISBLANK(Circuits!AN21),\" \",(Circuits!AN21))","v":" "},{"$f":"IF(ISBLANK(Circuits!AO21),\" \",(Circuits!AO21))","v":" "},null,null," ",null,"SUR"," ",null,null,null,null,null,null,null,""]
["Circuit 20",{"$f":"IF(ISBLANK(Circuits!AN22),\" \",(Circuits!AN22))","v":" "},{"$f":"IF(ISBLANK(Circuits!AO22),\" \",(Circuits!AO22))","v":" "},null,null," ",null,"SUR"," ",null,null,null,null,null,null,null,""]
[null,null,null,null,null,null,null,null,null,null,null,null,null,null,null,null,{"$f":"CONCATENATE(Q3,Q4,Q5,Q6,Q7,Q8,Q9,Q10,Q11,Q12,Q13,Q14,Q15,Q16,Q17,Q18,Q19,Q20,Q21,Q22)","v":""}]
[null,null,null,"TEMPS TOTAL",null,{"$f":"SUM(F3:F22)","v":"00:00:00"}]
[]
[null,null,null,"TEMPS MOYEN",null,{"$f":"IF(ISBLANK(D3),\" \",AVERAGE(F3:F22))","v":" "}]
[]
[null,null,null,"NB TOTAL BALISES",null,null,{"$f":"SUM(G3:G22)","v":0},"SUR",{"$f":"SUM(I3:I22)","v":0}]
[]
[null,null,null,{"$f":"COUNTA(D3:D22)","v":0},{"$f":"COUNTA(E3:E22)","v":0}]

{"sheet":"E20","index":24,"n_rows":30,"n_cols":17,"rows_kept":30,"cut":false,"hidden":false,"merged":[]}
[null,null,null,"EQUIPE ",20,null," ",null," ",{"$f":"NOW()","v":43688.614419444442}]
[null,"BALISES","NB","DEPART","ARRIVEE","TEMPS","NB Trouvées"]
["Circuit 1",{"$f":"IF(ISBLANK(Circuits!AP3),\" \",(Circuits!AP3))","v":" "},{"$f":"IF(ISBLANK(Circuits!AQ3),\" \",(Circuits!AQ3))","v":" "},null,null,{"$f":"IF(ISBLANK(E3),\" \",E3-D3)","v":" "},null,"SUR",{"$f":"IF(ISBLANK(D3),\" \",C3)","v":" "},null,null,null,null,null,null,null,{"$f":"IF(COUNTA(D3)=COUNTA(E3),\"\",B3)","v":""}]
["Circuit 2",{"$f":"IF(ISBLANK(Circuits!AP4),\" \",(Circuits!AP4))","v":" "},{"$f":"IF(ISBLANK(Circuits!AQ4),\" \",(Circuits!AQ4))","v":" "},null,null," ",null,"SUR",{"$f":"IF(ISBLANK(D4),\" \",C4)","v":" "},null,null,null,null,null,null,null,{"$f":"IF(COUNTA(D4)=COUNTA(E4),\"\",B4)","v":""}]
["Circuit 3",{"$f":"IF(ISBLANK(Circuits!AP5),\" \",(Circuits!AP5))","v":" "},{"$f":"IF(ISBLANK(Circuits!AQ5),\" \",(Circuits!AQ5))","v":" "},null,null," ",null,"SUR"," ",null,null,null,null,null,{"$f":"IF(ISBLANK('Liste classe'!E22),\" \",('Liste classe'!E22))","v":" "},null,""]
["Circuit 4",{"$f":"IF(ISBLANK(Circuits!AP6),\" \",(Circuits!AP6))","v":" "},{"$f":"IF(ISBLANK(Circuits!AQ6),\" \",(Circuits!AQ6))","v":" "},null,null," ",null,"SUR"," ",null,null,null,null,null,{"$f":"IF(ISBLANK('Liste classe'!F22),\" \",('Liste classe'!F22))","v":" "},null,""]
["Circuit 5",{"$f":"IF(ISBLANK(Circuits!AP7),\" \",(Circuits!AP7))","v":" "},{"$f":"IF(ISBLANK(Circuits!AQ7),\" \",(Circuits!AQ7))","v":" "},null,null," ",null,"SUR"," ",null,null,null,null,null,{"$f":"IF(ISBLANK('Liste classe'!G22),\" \",('Liste classe'!G22))","v":" "},null,""]
["Circuit 6",{"$f":"IF(ISBLANK(Circuits!AP8),\" \",(Circuits!AP8))","v":" "},{"$f":"IF(ISBLANK(Circuits!AQ8),\" \",(Circuits!AQ8))","v":" "},null,null," ",null,"SUR"," ",null,null,null,null,null,{"$f":"IF(ISBLANK('Liste classe'!H22),\" \",('Liste classe'!H22))","v":" "},null,""]
["Circuit 7",{"$f":"IF(ISBLANK(Circuits!AP9),\" \",(Circuits!AP9))","v":" "},{"$f":"IF(ISBLANK(Circuits!AQ9),\" \",(Circuits!AQ9))","v":" "},null,null," ",null,"SUR"," ",null,null,null,null,null,{"$f":"IF(ISBLANK('Liste classe'!I22),\" \",('Liste classe'!I22))","v":" "},null,""]
["Circuit 8",{"$f":"IF(ISBLANK(Circuits!AP10),\" \",(Circuits!AP10))","v":" "},{"$f":"IF(ISBLANK(Circuits!AQ10),\" \",(Circuits!AQ10))","v":" "},null,null," ",null,"SUR"," ",null,null,null,null,null,{"$f":"IF(ISBLANK('Liste classe'!J22),\" \",('Liste classe'!J22))","v":" "},null,""]
["Circuit 9",{"$f":"IF(ISBLANK(Circuits!AP11),\" \",(Circuits!AP11))","v":" "},{"$f":"IF(ISBLANK(Circuits!AQ11),\" \",(Circuits!AQ11))","v":" "},null,null," ",null,"SUR"," ",null,null,null,null,null,null,null,""]
["Circuit 10",{"$f":"IF(ISBLANK(Circuits!AP12),\" \",(Circuits!AP12))","v":" "},{"$f":"IF(ISBLANK(Circuits!AQ12),\" \",(Circuits!AQ12))","v":" "},null,null," ",null,"SUR"," ",null,null,null,null,null,null,null,""]
["Circuit 11",{"$f":"IF(ISBLANK(Circuits!AP13),\" \",(Circuits!AP13))","v":" "},{"$f":"IF(ISBLANK(Circuits!AQ13),\" \",(Circuits!AQ13))","v":" "},null,null," ",null,"SUR"," ",null,null,null,null,null,null,null,""]
["Circuit 12",{"$f":"IF(ISBLANK(Circuits!AP14),\" \",(Circuits!AP14))","v":" "},{"$f":"IF(ISBLANK(Circuits!AQ14),\" \",(Circuits!AQ14))","v":" "},null,null," ",null,"SUR"," ",null,null,null,null,null,null,null,""]
["Circuit 13",{"$f":"IF(ISBLANK(Circuits!AP15),\" \",(Circuits!AP15))","v":" "},{"$f":"IF(ISBLANK(Circuits!AQ15),\" \",(Circuits!AQ15))","v":" "},null,null," ",null,"SUR"," ",null,null,null,null,null,null,null,""]
["Circuit 14",{"$f":"IF(ISBLANK(Circuits!AP16),\" \",(Circuits!AP16))","v":" "},{"$f":"IF(ISBLANK(Circuits!AQ16),\" \",(Circuits!AQ16))","v":" "},null,null," ",null,"SUR"," ",null,null,null,null,null,null,null,""]
["Circuit 15",{"$f":"IF(ISBLANK(Circuits!AP17),\" \",(Circuits!AP17))","v":" "},{"$f":"IF(ISBLANK(Circuits!AQ17),\" \",(Circuits!AQ17))","v":" "},null,null," ",null,"SUR"," ",null,null,null,null,null,null,null,""]
["Circuit 16",{"$f":"IF(ISBLANK(Circuits!AP18),\" \",(Circuits!AP18))","v":" "},{"$f":"IF(ISBLANK(Circuits!AQ18),\" \",(Circuits!AQ18))","v":" "},null,null," ",null,"SUR"," ",null,null,null,null,null,null,null,""]
["Circuit 17",{"$f":"IF(ISBLANK(Circuits!AP19),\" \",(Circuits!AP19))","v":" "},{"$f":"IF(ISBLANK(Circuits!AQ19),\" \",(Circuits!AQ19))","v":" "},null,null," ",null,"SUR"," ",null,null,null,null,null,null,null,""]
["Circuit 18",{"$f":"IF(ISBLANK(Circuits!AP20),\" \",(Circuits!AP20))","v":" "},{"$f":"IF(ISBLANK(Circuits!AQ20),\" \",(Circuits!AQ20))","v":" "},null,null," ",null,"SUR"," ",null,null,null,null,null,null,null,""]
["Circuit 19",{"$f":"IF(ISBLANK(Circuits!AP21),\" \",(Circuits!AP21))","v":" "},{"$f":"IF(ISBLANK(Circuits!AQ21),\" \",(Circuits!AQ21))","v":" "},null,null," ",null,"SUR"," ",null,null,null,null,null,null,null,""]
["Circuit 20",{"$f":"IF(ISBLANK(Circuits!AP22),\" \",(Circuits!AP22))","v":" "},{"$f":"IF(ISBLANK(Circuits!AQ22),\" \",(Circuits!AQ22))","v":" "},null,null," ",null,"SUR"," ",null,null,null,null,null,null,null,""]
[null,null,null,null,null,null,null,null,null,null,null,null,null,null,null,null,{"$f":"CONCATENATE(Q3,Q4,Q5,Q6,Q7,Q8,Q9,Q10,Q11,Q12,Q13,Q14,Q15,Q16,Q17,Q18,Q19,Q20,Q21,Q22)","v":""}]
[null,null,null,"TEMPS TOTAL",null,{"$f":"SUM(F3:F22)","v":"00:00:00"}]
[]
[null,null,null,"TEMPS MOYEN",null,{"$f":"IF(ISBLANK(D3),\" \",AVERAGE(F3:F22))","v":" "}]
[]
[null,null,null,"NB TOTAL BALISES",null,null,{"$f":"SUM(G3:G22)","v":0},"SUR",{"$f":"SUM(I3:I22)","v":0}]
[]
[null,null,null,{"$f":"COUNTA(D3:D22)","v":0},{"$f":"COUNTA(E3:E22)","v":0}]

{"sheet":"E21","index":25,"n_rows":30,"n_cols":17,"rows_kept":30,"cut":false,"hidden":false,"merged":[]}
[null,null,null,"EQUIPE ",21,null," ",null," ",{"$f":"NOW()","v":43688.614419444442}]
[null,"BALISES","NB","DEPART","ARRIVEE","TEMPS","NB Trouvées"]
["Circuit 1",{"$f":"IF(ISBLANK(Circuits!AR3),\" \",(Circuits!AR3))","v":" "},{"$f":"IF(ISBLANK(Circuits!AS3),\" \",(Circuits!AS3))","v":" "},null,null,{"$f":"IF(ISBLANK(E3),\" \",E3-D3)","v":" "},null,"SUR",{"$f":"IF(ISBLANK(D3),\" \",C3)","v":" "},null,null,null,null,null,null,null,{"$f":"IF(COUNTA(D3)=COUNTA(E3),\"\",B3)","v":""}]
["Circuit 2",{"$f":"IF(ISBLANK(Circuits!AR4),\" \",(Circuits!AR4))","v":" "},{"$f":"IF(ISBLANK(Circuits!AS4),\" \",(Circuits!AS4))","v":" "},null,null," ",null,"SUR",{"$f":"IF(ISBLANK(D4),\" \",C4)","v":" "},null,null,null,null,null,null,null,{"$f":"IF(COUNTA(D4)=COUNTA(E4),\"\",B4)","v":""}]
["Circuit 3",{"$f":"IF(ISBLANK(Circuits!AR5),\" \",(Circuits!AR5))","v":" "},{"$f":"IF(ISBLANK(Circuits!AS5),\" \",(Circuits!AS5))","v":" "},null,null," ",null,"SUR"," ",null,null,null,null,null,{"$f":"IF(ISBLANK('Liste classe'!E23),\" \",('Liste classe'!E23))","v":" "},null,""]
["Circuit 4",{"$f":"IF(ISBLANK(Circuits!AR6),\" \",(Circuits!AR6))","v":" "},{"$f":"IF(ISBLANK(Circuits!AS6),\" \",(Circuits!AS6))","v":" "},null,null," ",null,"SUR"," ",null,null,null,null,null,{"$f":"IF(ISBLANK('Liste classe'!F23),\" \",('Liste classe'!F23))","v":" "},null,""]
["Circuit 5",{"$f":"IF(ISBLANK(Circuits!AR7),\" \",(Circuits!AR7))","v":" "},{"$f":"IF(ISBLANK(Circuits!AS7),\" \",(Circuits!AS7))","v":" "},null,null," ",null,"SUR"," ",null,null,null,null,null,{"$f":"IF(ISBLANK('Liste classe'!G23),\" \",('Liste classe'!G23))","v":" "},null,""]
["Circuit 6",{"$f":"IF(ISBLANK(Circuits!AR8),\" \",(Circuits!AR8))","v":" "},{"$f":"IF(ISBLANK(Circuits!AS8),\" \",(Circuits!AS8))","v":" "},null,null," ",null,"SUR"," ",null,null,null,null,null,{"$f":"IF(ISBLANK('Liste classe'!H23),\" \",('Liste classe'!H23))","v":" "},null,""]
["Circuit 7",{"$f":"IF(ISBLANK(Circuits!AR9),\" \",(Circuits!AR9))","v":" "},{"$f":"IF(ISBLANK(Circuits!AS9),\" \",(Circuits!AS9))","v":" "},null,null," ",null,"SUR"," ",null,null,null,null,null,{"$f":"IF(ISBLANK('Liste classe'!I23),\" \",('Liste classe'!I23))","v":" "},null,""]
["Circuit 8",{"$f":"IF(ISBLANK(Circuits!AR10),\" \",(Circuits!AR10))","v":" "},{"$f":"IF(ISBLANK(Circuits!AS10),\" \",(Circuits!AS10))","v":" "},null,null," ",null,"SUR"," ",null,null,null,null,null,{"$f":"IF(ISBLANK('Liste classe'!J23),\" \",('Liste classe'!J23))","v":" "},null,""]
["Circuit 9",{"$f":"IF(ISBLANK(Circuits!AR11),\" \",(Circuits!AR11))","v":" "},{"$f":"IF(ISBLANK(Circuits!AS11),\" \",(Circuits!AS11))","v":" "},null,null," ",null,"SUR"," ",null,null,null,null,null,null,null,""]
["Circuit 10",{"$f":"IF(ISBLANK(Circuits!AR12),\" \",(Circuits!AR12))","v":" "},{"$f":"IF(ISBLANK(Circuits!AS12),\" \",(Circuits!AS12))","v":" "},null,null," ",null,"SUR"," ",null,null,null,null,null,null,null,""]
["Circuit 11",{"$f":"IF(ISBLANK(Circuits!AR13),\" \",(Circuits!AR13))","v":" "},{"$f":"IF(ISBLANK(Circuits!AS13),\" \",(Circuits!AS13))","v":" "},null,null," ",null,"SUR"," ",null,null,null,null,null,null,null,""]
["Circuit 12",{"$f":"IF(ISBLANK(Circuits!AR14),\" \",(Circuits!AR14))","v":" "},{"$f":"IF(ISBLANK(Circuits!AS14),\" \",(Circuits!AS14))","v":" "},null,null," ",null,"SUR"," ",null,null,null,null,null,null,null,""]
["Circuit 13",{"$f":"IF(ISBLANK(Circuits!AR15),\" \",(Circuits!AR15))","v":" "},{"$f":"IF(ISBLANK(Circuits!AS15),\" \",(Circuits!AS15))","v":" "},null,null," ",null,"SUR"," ",null,null,null,null,null,null,null,""]
["Circuit 14",{"$f":"IF(ISBLANK(Circuits!AR16),\" \",(Circuits!AR16))","v":" "},{"$f":"IF(ISBLANK(Circuits!AS16),\" \",(Circuits!AS16))","v":" "},null,null," ",null,"SUR"," ",null,null,null,null,null,null,null,""]
["Circuit 15",{"$f":"IF(ISBLANK(Circuits!AR17),\" \",(Circuits!AR17))","v":" "},{"$f":"IF(ISBLANK(Circuits!AS17),\" \",(Circuits!AS17))","v":" "},null,null," ",null,"SUR"," ",null,null,null,null,null,null,null,""]
["Circuit 16",{"$f":"IF(ISBLANK(Circuits!AR18),\" \",(Circuits!AR18))","v":" "},{"$f":"IF(ISBLANK(Circuits!AS18),\" \",(Circuits!AS18))","v":" "},null,null," ",null,"SUR"," ",null,null,null,null,null,null,null,""]
["Circuit 17",{"$f":"IF(ISBLANK(Circuits!AR19),\" \",(Circuits!AR19))","v":" "},{"$f":"IF(ISBLANK(Circuits!AS19),\" \",(Circuits!AS19))","v":" "},null,null," ",null,"SUR"," ",null,null,null,null,null,null,null,""]
["Circuit 18",{"$f":"IF(ISBLANK(Circuits!AR20),\" \",(Circuits!AR20))","v":" "},{"$f":"IF(ISBLANK(Circuits!AS20),\" \",(Circuits!AS20))","v":" "},null,null," ",null,"SUR"," ",null,null,null,null,null,null,null,""]
["Circuit 19",{"$f":"IF(ISBLANK(Circuits!AR21),\" \",(Circuits!AR21))","v":" "},{"$f":"IF(ISBLANK(Circuits!AS21),\" \",(Circuits!AS21))","v":" "},null,null," ",null,"SUR"," ",null,null,null,null,null,null,null,""]
["Circuit 20",{"$f":"IF(ISBLANK(Circuits!AR22),\" \",(Circuits!AR22))","v":" "},{"$f":"IF(ISBLANK(Circuits!AS22),\" \",(Circuits!AS22))","v":" "},null,null," ",null,"SUR"," ",null,null,null,null,null,null,null,""]
[null,null,null,null,null,null,null,null,null,null,null,null,null,null,null,null,{"$f":"CONCATENATE(Q3,Q4,Q5,Q6,Q7,Q8,Q9,Q10,Q11,Q12,Q13,Q14,Q15,Q16,Q17,Q18,Q19,Q20,Q21,Q22)","v":""}]
[null,null,null,"TEMPS TOTAL",null,{"$f":"SUM(F3:F22)","v":"00:00:00"}]
[]
[null,null,null,"TEMPS MOYEN",null,{"$f":"IF(ISBLANK(D3),\" \",AVERAGE(F3:F22))","v":" "}]
[]
[null,null,null,"NB TOTAL BALISES",null,null,{"$f":"SUM(G3:G22)","v":0},"SUR",{"$f":"SUM(I3:I22)","v":0}]
[]
[null,null,null,{"$f":"COUNTA(D3:D22)","v":0},{"$f":"COUNTA(E3:E22)","v":0}]

{"sheet":"E22","index":26,"n_rows":30,"n_cols":17,"rows_kept":30,"cut":false,"hidden":false,"merged":[]}
[null,null,null,"EQUIPE ",22,null," ",null," ",{"$f":"NOW()","v":43688.614419444442}]
[null,"BALISES","NB","DEPART","ARRIVEE","TEMPS","NB Trouvées"]
["Circuit 1",{"$f":"IF(ISBLANK(Circuits!AT3),\" \",(Circuits!AT3))","v":" "},{"$f":"IF(ISBLANK(Circuits!AU3),\" \",(Circuits!AU3))","v":" "},null,null,{"$f":"IF(ISBLANK(E3),\" \",E3-D3)","v":" "},null,"SUR",{"$f":"IF(ISBLANK(D3),\" \",C3)","v":" "},null,null,null,null,null,null,null,{"$f":"IF(COUNTA(D3)=COUNTA(E3),\"\",B3)","v":""}]
["Circuit 2",{"$f":"IF(ISBLANK(Circuits!AT4),\" \",(Circuits!AT4))","v":" "},{"$f":"IF(ISBLANK(Circuits!AU4),\" \",(Circuits!AU4))","v":" "},null,null," ",null,"SUR",{"$f":"IF(ISBLANK(D4),\" \",C4)","v":" "},null,null,null,null,null,null,null,{"$f":"IF(COUNTA(D4)=COUNTA(E4),\"\",B4)","v":""}]
["Circuit 3",{"$f":"IF(ISBLANK(Circuits!AT5),\" \",(Circuits!AT5))","v":" "},{"$f":"IF(ISBLANK(Circuits!AU5),\" \",(Circuits!AU5))","v":" "},null,null," ",null,"SUR"," ",null,null,null,null,null,{"$f":"IF(ISBLANK('Liste classe'!E24),\" \",('Liste classe'!E24))","v":" "},null,""]
["Circuit 4",{"$f":"IF(ISBLANK(Circuits!AT6),\" \",(Circuits!AT6))","v":" "},{"$f":"IF(ISBLANK(Circuits!AU6),\" \",(Circuits!AU6))","v":" "},null,null," ",null,"SUR"," ",null,null,null,null,null,{"$f":"IF(ISBLANK('Liste classe'!F24),\" \",('Liste classe'!F24))","v":" "},null,""]
["Circuit 5",{"$f":"IF(ISBLANK(Circuits!AT7),\" \",(Circuits!AT7))","v":" "},{"$f":"IF(ISBLANK(Circuits!AU7),\" \",(Circuits!AU7))","v":" "},null,null," ",null,"SUR"," ",null,null,null,null,null,{"$f":"IF(ISBLANK('Liste classe'!G24),\" \",('Liste classe'!G24))","v":" "},null,""]
["Circuit 6",{"$f":"IF(ISBLANK(Circuits!AT8),\" \",(Circuits!AT8))","v":" "},{"$f":"IF(ISBLANK(Circuits!AU8),\" \",(Circuits!AU8))","v":" "},null,null," ",null,"SUR"," ",null,null,null,null,null,{"$f":"IF(ISBLANK('Liste classe'!H24),\" \",('Liste classe'!H24))","v":" "},null,""]
["Circuit 7",{"$f":"IF(ISBLANK(Circuits!AT9),\" \",(Circuits!AT9))","v":" "},{"$f":"IF(ISBLANK(Circuits!AU9),\" \",(Circuits!AU9))","v":" "},null,null," ",null,"SUR"," ",null,null,null,null,null,{"$f":"IF(ISBLANK('Liste classe'!I24),\" \",('Liste classe'!I24))","v":" "},null,""]
["Circuit 8",{"$f":"IF(ISBLANK(Circuits!AT10),\" \",(Circuits!AT10))","v":" "},{"$f":"IF(ISBLANK(Circuits!AU10),\" \",(Circuits!AU10))","v":" "},null,null," ",null,"SUR"," ",null,null,null,null,null,{"$f":"IF(ISBLANK('Liste classe'!J24),\" \",('Liste classe'!J24))","v":" "},null,""]
["Circuit 9",{"$f":"IF(ISBLANK(Circuits!AT11),\" \",(Circuits!AT11))","v":" "},{"$f":"IF(ISBLANK(Circuits!AU11),\" \",(Circuits!AU11))","v":" "},null,null," ",null,"SUR"," ",null,null,null,null,null,null,null,""]
["Circuit 10",{"$f":"IF(ISBLANK(Circuits!AT12),\" \",(Circuits!AT12))","v":" "},{"$f":"IF(ISBLANK(Circuits!AU12),\" \",(Circuits!AU12))","v":" "},null,null," ",null,"SUR"," ",null,null,null,null,null,null,null,""]
["Circuit 11",{"$f":"IF(ISBLANK(Circuits!AT13),\" \",(Circuits!AT13))","v":" "},{"$f":"IF(ISBLANK(Circuits!AU13),\" \",(Circuits!AU13))","v":" "},null,null," ",null,"SUR"," ",null,null,null,null,null,null,null,""]
["Circuit 12",{"$f":"IF(ISBLANK(Circuits!AT14),\" \",(Circuits!AT14))","v":" "},{"$f":"IF(ISBLANK(Circuits!AU14),\" \",(Circuits!AU14))","v":" "},null,null," ",null,"SUR"," ",null,null,null,null,null,null,null,""]
["Circuit 13",{"$f":"IF(ISBLANK(Circuits!AT15),\" \",(Circuits!AT15))","v":" "},{"$f":"IF(ISBLANK(Circuits!AU15),\" \",(Circuits!AU15))","v":" "},null,null," ",null,"SUR"," ",null,null,null,null,null,null,null,""]
["Circuit 14",{"$f":"IF(ISBLANK(Circuits!AT16),\" \",(Circuits!AT16))","v":" "},{"$f":"IF(ISBLANK(Circuits!AU16),\" \",(Circuits!AU16))","v":" "},null,null," ",null,"SUR"," ",null,null,null,null,null,null,null,""]
["Circuit 15",{"$f":"IF(ISBLANK(Circuits!AT17),\" \",(Circuits!AT17))","v":" "},{"$f":"IF(ISBLANK(Circuits!AU17),\" \",(Circuits!AU17))","v":" "},null,null," ",null,"SUR"," ",null,null,null,null,null,null,null,""]
["Circuit 16",{"$f":"IF(ISBLANK(Circuits!AT18),\" \",(Circuits!AT18))","v":" "},{"$f":"IF(ISBLANK(Circuits!AU18),\" \",(Circuits!AU18))","v":" "},null,null," ",null,"SUR"," ",null,null,null,null,null,null,null,""]
["Circuit 17",{"$f":"IF(ISBLANK(Circuits!AT19),\" \",(Circuits!AT19))","v":" "},{"$f":"IF(ISBLANK(Circuits!AU19),\" \",(Circuits!AU19))","v":" "},null,null," ",null,"SUR"," ",null,null,null,null,null,null,null,""]
["Circuit 18",{"$f":"IF(ISBLANK(Circuits!AT20),\" \",(Circuits!AT20))","v":" "},{"$f":"IF(ISBLANK(Circuits!AU20),\" \",(Circuits!AU20))","v":" "},null,null," ",null,"SUR"," ",null,null,null,null,null,null,null,""]
["Circuit 19",{"$f":"IF(ISBLANK(Circuits!AT21),\" \",(Circuits!AT21))","v":" "},{"$f":"IF(ISBLANK(Circuits!AU21),\" \",(Circuits!AU21))","v":" "},null,null," ",null,"SUR"," ",null,null,null,null,null,null,null,""]
["Circuit 20",{"$f":"IF(ISBLANK(Circuits!AT22),\" \",(Circuits!AT22))","v":" "},{"$f":"IF(ISBLANK(Circuits!AU22),\" \",(Circuits!AU22))","v":" "},null,null," ",null,"SUR"," ",null,null,null,null,null,null,null,""]
[null,null,null,null,null,null,null,null,null,null,null,null,null,null,null,null,{"$f":"CONCATENATE(Q3,Q4,Q5,Q6,Q7,Q8,Q9,Q10,Q11,Q12,Q13,Q14,Q15,Q16,Q17,Q18,Q19,Q20,Q21,Q22)","v":""}]
[null,null,null,"TEMPS TOTAL",null,{"$f":"SUM(F3:F22)","v":"00:00:00"}]
[]
[null,null,null,"TEMPS MOYEN",null,{"$f":"IF(ISBLANK(D3),\" \",AVERAGE(F3:F22))","v":" "}]
[]
[null,null,null,"NB TOTAL BALISES",null,null,{"$f":"SUM(G3:G22)","v":0},"SUR",{"$f":"SUM(I3:I22)","v":0}]
[]
[null,null,null,{"$f":"COUNTA(D3:D22)","v":0},{"$f":"COUNTA(E3:E22)","v":0}]

{"sheet":"E23","index":27,"n_rows":30,"n_cols":17,"rows_kept":30,"cut":false,"hidden":false,"merged":[]}
[null,null,null,"EQUIPE ",23,null," ",null," ",{"$f":"NOW()","v":43688.614419444442}]
[null,"BALISES","NB","DEPART","ARRIVEE","TEMPS","NB Trouvées"]
["Circuit 1",{"$f":"IF(ISBLANK(Circuits!AV3),\" \",(Circuits!AV3))","v":" "},{"$f":"IF(ISBLANK(Circuits!AW3),\" \",(Circuits!AW3))","v":" "},null,null,{"$f":"IF(ISBLANK(E3),\" \",E3-D3)","v":" "},null,"SUR",{"$f":"IF(ISBLANK(D3),\" \",C3)","v":" "},null,null,null,null,null,null,null,{"$f":"IF(COUNTA(D3)=COUNTA(E3),\"\",B3)","v":""}]
["Circuit 2",{"$f":"IF(ISBLANK(Circuits!AV4),\" \",(Circuits!AV4))","v":" "},{"$f":"IF(ISBLANK(Circuits!AW4),\" \",(Circuits!AW4))","v":" "},null,null," ",null,"SUR",{"$f":"IF(ISBLANK(D4),\" \",C4)","v":" "},null,null,null,null,null,null,null,{"$f":"IF(COUNTA(D4)=COUNTA(E4),\"\",B4)","v":""}]
["Circuit 3",{"$f":"IF(ISBLANK(Circuits!AV5),\" \",(Circuits!AV5))","v":" "},{"$f":"IF(ISBLANK(Circuits!AW5),\" \",(Circuits!AW5))","v":" "},null,null," ",null,"SUR"," ",null,null,null,null,null,{"$f":"IF(ISBLANK('Liste classe'!E25),\" \",('Liste classe'!E25))","v":" "},null,""]
["Circuit 4",{"$f":"IF(ISBLANK(Circuits!AV6),\" \",(Circuits!AV6))","v":" "},{"$f":"IF(ISBLANK(Circuits!AW6),\" \",(Circuits!AW6))","v":" "},null,null," ",null,"SUR"," ",null,null,null,null,null,{"$f":"IF(ISBLANK('Liste classe'!F25),\" \",('Liste classe'!F25))","v":" "},null,""]
["Circuit 5",{"$f":"IF(ISBLANK(Circuits!AV7),\" \",(Circuits!AV7))","v":" "},{"$f":"IF(ISBLANK(Circuits!AW7),\" \",(Circuits!AW7))","v":" "},null,null," ",null,"SUR"," ",null,null,null,null,null,{"$f":"IF(ISBLANK('Liste classe'!G25),\" \",('Liste classe'!G25))","v":" "},null,""]
["Circuit 6",{"$f":"IF(ISBLANK(Circuits!AV8),\" \",(Circuits!AV8))","v":" "},{"$f":"IF(ISBLANK(Circuits!AW8),\" \",(Circuits!AW8))","v":" "},null,null," ",null,"SUR"," ",null,null,null,null,null,{"$f":"IF(ISBLANK('Liste classe'!H25),\" \",('Liste classe'!H25))","v":" "},null,""]
["Circuit 7",{"$f":"IF(ISBLANK(Circuits!AV9),\" \",(Circuits!AV9))","v":" "},{"$f":"IF(ISBLANK(Circuits!AW9),\" \",(Circuits!AW9))","v":" "},null,null," ",null,"SUR"," ",null,null,null,null,null,{"$f":"IF(ISBLANK('Liste classe'!I25),\" \",('Liste classe'!I25))","v":" "},null,""]
["Circuit 8",{"$f":"IF(ISBLANK(Circuits!AV10),\" \",(Circuits!AV10))","v":" "},{"$f":"IF(ISBLANK(Circuits!AW10),\" \",(Circuits!AW10))","v":" "},null,null," ",null,"SUR"," ",null,null,null,null,null,{"$f":"IF(ISBLANK('Liste classe'!J25),\" \",('Liste classe'!J25))","v":" "},null,""]
["Circuit 9",{"$f":"IF(ISBLANK(Circuits!AV11),\" \",(Circuits!AV11))","v":" "},{"$f":"IF(ISBLANK(Circuits!AW11),\" \",(Circuits!AW11))","v":" "},null,null," ",null,"SUR"," ",null,null,null,null,null,null,null,""]
["Circuit 10",{"$f":"IF(ISBLANK(Circuits!AV12),\" \",(Circuits!AV12))","v":" "},{"$f":"IF(ISBLANK(Circuits!AW12),\" \",(Circuits!AW12))","v":" "},null,null," ",null,"SUR"," ",null,null,null,null,null,null,null,""]
["Circuit 11",{"$f":"IF(ISBLANK(Circuits!AV13),\" \",(Circuits!AV13))","v":" "},{"$f":"IF(ISBLANK(Circuits!AW13),\" \",(Circuits!AW13))","v":" "},null,null," ",null,"SUR"," ",null,null,null,null,null,null,null,""]
["Circuit 12",{"$f":"IF(ISBLANK(Circuits!AV14),\" \",(Circuits!AV14))","v":" "},{"$f":"IF(ISBLANK(Circuits!AW14),\" \",(Circuits!AW14))","v":" "},null,null," ",null,"SUR"," ",null,null,null,null,null,null,null,""]
["Circuit 13",{"$f":"IF(ISBLANK(Circuits!AV15),\" \",(Circuits!AV15))","v":" "},{"$f":"IF(ISBLANK(Circuits!AW15),\" \",(Circuits!AW15))","v":" "},null,null," ",null,"SUR"," ",null,null,null,null,null,null,null,""]
["Circuit 14",{"$f":"IF(ISBLANK(Circuits!AV16),\" \",(Circuits!AV16))","v":" "},{"$f":"IF(ISBLANK(Circuits!AW16),\" \",(Circuits!AW16))","v":" "},null,null," ",null,"SUR"," ",null,null,null,null,null,null,null,""]
["Circuit 15",{"$f":"IF(ISBLANK(Circuits!AV17),\" \",(Circuits!AV17))","v":" "},{"$f":"IF(ISBLANK(Circuits!AW17),\" \",(Circuits!AW17))","v":" "},null,null," ",null,"SUR"," ",null,null,null,null,null,null,null,""]
["Circuit 16",{"$f":"IF(ISBLANK(Circuits!AV18),\" \",(Circuits!AV18))","v":" "},{"$f":"IF(ISBLANK(Circuits!AW18),\" \",(Circuits!AW18))","v":" "},null,null," ",null,"SUR"," ",null,null,null,null,null,null,null,""]
["Circuit 17",{"$f":"IF(ISBLANK(Circuits!AV19),\" \",(Circuits!AV19))","v":" "},{"$f":"IF(ISBLANK(Circuits!AW19),\" \",(Circuits!AW19))","v":" "},null,null," ",null,"SUR"," ",null,null,null,null,null,null,null,""]
["Circuit 18",{"$f":"IF(ISBLANK(Circuits!AV20),\" \",(Circuits!AV20))","v":" "},{"$f":"IF(ISBLANK(Circuits!AW20),\" \",(Circuits!AW20))","v":" "},null,null," ",null,"SUR"," ",null,null,null,null,null,null,null,""]
["Circuit 19",{"$f":"IF(ISBLANK(Circuits!AV21),\" \",(Circuits!AV21))","v":" "},{"$f":"IF(ISBLANK(Circuits!AW21),\" \",(Circuits!AW21))","v":" "},null,null," ",null,"SUR"," ",null,null,null,null,null,null,null,""]
["Circuit 20",{"$f":"IF(ISBLANK(Circuits!AV22),\" \",(Circuits!AV22))","v":" "},{"$f":"IF(ISBLANK(Circuits!AW22),\" \",(Circuits!AW22))","v":" "},null,null," ",null,"SUR"," ",null,null,null,null,null,null,null,""]
[null,null,null,null,null,null,null,null,null,null,null,null,null,null,null,null,{"$f":"CONCATENATE(Q3,Q4,Q5,Q6,Q7,Q8,Q9,Q10,Q11,Q12,Q13,Q14,Q15,Q16,Q17,Q18,Q19,Q20,Q21,Q22)","v":""}]
[null,null,null,"TEMPS TOTAL",null,{"$f":"SUM(F3:F22)","v":"00:00:00"}]
[]
[null,null,null,"TEMPS MOYEN",null,{"$f":"IF(ISBLANK(D3),\" \",AVERAGE(F3:F22))","v":" "}]
[]
[null,null,null,"NB TOTAL BALISES",null,null,{"$f":"SUM(G3:G22)","v":0},"SUR",{"$f":"SUM(I3:I22)","v":0}]
[]
[null,null,null,{"$f":"COUNTA(D3:D22)","v":0},{"$f":"COUNTA(E3:E22)","v":0}]

{"sheet":"E24","index":28,"n_rows":30,"n_cols":17,"rows_kept":30,"cut":false,"hidden":false,"merged":[]}
[null,null,null,"EQUIPE ",24,null," ",null," ",{"$f":"NOW()","v":43688.614419444442}]
[null,"BALISES","NB","DEPART","ARRIVEE","TEMPS","NB Trouvées"]
["Circuit 1",{"$f":"IF(ISBLANK(Circuits!AX3),\" \",(Circuits!AX3))","v":" "},{"$f":"IF(ISBLANK(Circuits!AY3),\" \",(Circuits!AY3))","v":" "},null,null,{"$f":"IF(ISBLANK(E3),\" \",E3-D3)","v":" "},null,"SUR",{"$f":"IF(ISBLANK(D3),\" \",C3)","v":" "},null,null,null,null,null,null,null,{"$f":"IF(COUNTA(D3)=COUNTA(E3),\"\",B3)","v":""}]
["Circuit 2",{"$f":"IF(ISBLANK(Circuits!AX4),\" \",(Circuits!AX4))","v":" "},{"$f":"IF(ISBLANK(Circuits!AY4),\" \",(Circuits!AY4))","v":" "},null,null," ",null,"SUR",{"$f":"IF(ISBLANK(D4),\" \",C4)","v":" "},null,null,null,null,null,null,null,{"$f":"IF(COUNTA(D4)=COUNTA(E4),\"\",B4)","v":""}]
["Circuit 3",{"$f":"IF(ISBLANK(Circuits!AX5),\" \",(Circuits!AX5))","v":" "},{"$f":"IF(ISBLANK(Circuits!AY5),\" \",(Circuits!AY5))","v":" "},null,null," ",null,"SUR"," ",null,null,null,null,null,{"$f":"IF(ISBLANK('Liste classe'!E26),\" \",('Liste classe'!E26))","v":" "},null,""]
["Circuit 4",{"$f":"IF(ISBLANK(Circuits!AX6),\" \",(Circuits!AX6))","v":" "},{"$f":"IF(ISBLANK(Circuits!AY6),\" \",(Circuits!AY6))","v":" "},null,null," ",null,"SUR"," ",null,null,null,null,null,{"$f":"IF(ISBLANK('Liste classe'!F26),\" \",('Liste classe'!F26))","v":" "},null,""]
["Circuit 5",{"$f":"IF(ISBLANK(Circuits!AX7),\" \",(Circuits!AX7))","v":" "},{"$f":"IF(ISBLANK(Circuits!AY7),\" \",(Circuits!AY7))","v":" "},null,null," ",null,"SUR"," ",null,null,null,null,null,{"$f":"IF(ISBLANK('Liste classe'!G26),\" \",('Liste classe'!G26))","v":" "},null,""]
["Circuit 6",{"$f":"IF(ISBLANK(Circuits!AX8),\" \",(Circuits!AX8))","v":" "},{"$f":"IF(ISBLANK(Circuits!AY8),\" \",(Circuits!AY8))","v":" "},null,null," ",null,"SUR"," ",null,null,null,null,null,{"$f":"IF(ISBLANK('Liste classe'!H26),\" \",('Liste classe'!H26))","v":" "},null,""]
["Circuit 7",{"$f":"IF(ISBLANK(Circuits!AX9),\" \",(Circuits!AX9))","v":" "},{"$f":"IF(ISBLANK(Circuits!AY9),\" \",(Circuits!AY9))","v":" "},null,null," ",null,"SUR"," ",null,null,null,null,null,{"$f":"IF(ISBLANK('Liste classe'!I26),\" \",('Liste classe'!I26))","v":" "},null,""]
["Circuit 8",{"$f":"IF(ISBLANK(Circuits!AX10),\" \",(Circuits!AX10))","v":" "},{"$f":"IF(ISBLANK(Circuits!AY10),\" \",(Circuits!AY10))","v":" "},null,null," ",null,"SUR"," ",null,null,null,null,null,{"$f":"IF(ISBLANK('Liste classe'!J26),\" \",('Liste classe'!J26))","v":" "},null,""]
["Circuit 9",{"$f":"IF(ISBLANK(Circuits!AX11),\" \",(Circuits!AX11))","v":" "},{"$f":"IF(ISBLANK(Circuits!AY11),\" \",(Circuits!AY11))","v":" "},null,null," ",null,"SUR"," ",null,null,null,null,null,null,null,""]
["Circuit 10",{"$f":"IF(ISBLANK(Circuits!AX12),\" \",(Circuits!AX12))","v":" "},{"$f":"IF(ISBLANK(Circuits!AY12),\" \",(Circuits!AY12))","v":" "},null,null," ",null,"SUR"," ",null,null,null,null,null,null,null,""]
["Circuit 11",{"$f":"IF(ISBLANK(Circuits!AX13),\" \",(Circuits!AX13))","v":" "},{"$f":"IF(ISBLANK(Circuits!AY13),\" \",(Circuits!AY13))","v":" "},null,null," ",null,"SUR"," ",null,null,null,null,null,null,null,""]
["Circuit 12",{"$f":"IF(ISBLANK(Circuits!AX14),\" \",(Circuits!AX14))","v":" "},{"$f":"IF(ISBLANK(Circuits!AY14),\" \",(Circuits!AY14))","v":" "},null,null," ",null,"SUR"," ",null,null,null,null,null,null,null,""]
["Circuit 13",{"$f":"IF(ISBLANK(Circuits!AX15),\" \",(Circuits!AX15))","v":" "},{"$f":"IF(ISBLANK(Circuits!AY15),\" \",(Circuits!AY15))","v":" "},null,null," ",null,"SUR"," ",null,null,null,null,null,null,null,""]
["Circuit 14",{"$f":"IF(ISBLANK(Circuits!AX16),\" \",(Circuits!AX16))","v":" "},{"$f":"IF(ISBLANK(Circuits!AY16),\" \",(Circuits!AY16))","v":" "},null,null," ",null,"SUR"," ",null,null,null,null,null,null,null,""]
["Circuit 15",{"$f":"IF(ISBLANK(Circuits!AX17),\" \",(Circuits!AX17))","v":" "},{"$f":"IF(ISBLANK(Circuits!AY17),\" \",(Circuits!AY17))","v":" "},null,null," ",null,"SUR"," ",null,null,null,null,null,null,null,""]
["Circuit 16",{"$f":"IF(ISBLANK(Circuits!AX18),\" \",(Circuits!AX18))","v":" "},{"$f":"IF(ISBLANK(Circuits!AY18),\" \",(Circuits!AY18))","v":" "},null,null," ",null,"SUR"," ",null,null,null,null,null,null,null,""]
["Circuit 17",{"$f":"IF(ISBLANK(Circuits!AX19),\" \",(Circuits!AX19))","v":" "},{"$f":"IF(ISBLANK(Circuits!AY19),\" \",(Circuits!AY19))","v":" "},null,null," ",null,"SUR"," ",null,null,null,null,null,null,null,""]
["Circuit 18",{"$f":"IF(ISBLANK(Circuits!AX20),\" \",(Circuits!AX20))","v":" "},{"$f":"IF(ISBLANK(Circuits!AY20),\" \",(Circuits!AY20))","v":" "},null,null," ",null,"SUR"," ",null,null,null,null,null,null,null,""]
["Circuit 19",{"$f":"IF(ISBLANK(Circuits!AX21),\" \",(Circuits!AX21))","v":" "},{"$f":"IF(ISBLANK(Circuits!AY21),\" \",(Circuits!AY21))","v":" "},null,null," ",null,"SUR"," ",null,null,null,null,null,null,null,""]
["Circuit 20",{"$f":"IF(ISBLANK(Circuits!AX22),\" \",(Circuits!AX22))","v":" "},{"$f":"IF(ISBLANK(Circuits!AY22),\" \",(Circuits!AY22))","v":" "},null,null," ",null,"SUR"," ",null,null,null,null,null,null,null,""]
[null,null,null,null,null,null,null,null,null,null,null,null,null,null,null,null,{"$f":"CONCATENATE(Q3,Q4,Q5,Q6,Q7,Q8,Q9,Q10,Q11,Q12,Q13,Q14,Q15,Q16,Q17,Q18,Q19,Q20,Q21,Q22)","v":""}]
[null,null,null,"TEMPS TOTAL",null,{"$f":"SUM(F3:F22)","v":"00:00:00"}]
[]
[null,null,null,"TEMPS MOYEN",null,{"$f":"IF(ISBLANK(D3),\" \",AVERAGE(F3:F22))","v":" "}]
[]
[null,null,null,"NB TOTAL BALISES",null,null,{"$f":"SUM(G3:G22)","v":0},"SUR",{"$f":"SUM(I3:I22)","v":0}]
[]
[null,null,null,{"$f":"COUNTA(D3:D22)","v":0},{"$f":"COUNTA(E3:E22)","v":0}]

{"sheet":"E25","index":29,"n_rows":30,"n_cols":17,"rows_kept":30,"cut":false,"hidden":false,"merged":[]}
[null,null,null,"EQUIPE ",25,null," ",null," ",{"$f":"NOW()","v":43688.614419444442}]
[null,"BALISES","NB","DEPART","ARRIVEE","TEMPS","NB Trouvées"]
["Circuit 1",{"$f":"IF(ISBLANK(Circuits!AZ3),\" \",(Circuits!AZ3))","v":" "},{"$f":"IF(ISBLANK(Circuits!BA3),\" \",(Circuits!BA3))","v":" "},null,null,{"$f":"IF(ISBLANK(E3),\" \",E3-D3)","v":" "},null,"SUR",{"$f":"IF(ISBLANK(D3),\" \",C3)","v":" "},null,null,null,null,null,null,null,{"$f":"IF(COUNTA(D3)=COUNTA(E3),\"\",B3)","v":""}]
["Circuit 2",{"$f":"IF(ISBLANK(Circuits!AZ4),\" \",(Circuits!AZ4))","v":" "},{"$f":"IF(ISBLANK(Circuits!BA4),\" \",(Circuits!BA4))","v":" "},null,null," ",null,"SUR",{"$f":"IF(ISBLANK(D4),\" \",C4)","v":" "},null,null,null,null,null,null,null,{"$f":"IF(COUNTA(D4)=COUNTA(E4),\"\",B4)","v":""}]
["Circuit 3",{"$f":"IF(ISBLANK(Circuits!AZ5),\" \",(Circuits!AZ5))","v":" "},{"$f":"IF(ISBLANK(Circuits!BA5),\" \",(Circuits!BA5))","v":" "},null,null," ",null,"SUR"," ",null,null,null,null,null,{"$f":"IF(ISBLANK('Liste classe'!E27),\" \",('Liste classe'!E27))","v":" "},null,""]
["Circuit 4",{"$f":"IF(ISBLANK(Circuits!AZ6),\" \",(Circuits!AZ6))","v":" "},{"$f":"IF(ISBLANK(Circuits!BA6),\" \",(Circuits!BA6))","v":" "},null,null," ",null,"SUR"," ",null,null,null,null,null,{"$f":"IF(ISBLANK('Liste classe'!F27),\" \",('Liste classe'!F27))","v":" "},null,""]
["Circuit 5",{"$f":"IF(ISBLANK(Circuits!AZ7),\" \",(Circuits!AZ7))","v":" "},{"$f":"IF(ISBLANK(Circuits!BA7),\" \",(Circuits!BA7))","v":" "},null,null," ",null,"SUR"," ",null,null,null,null,null,{"$f":"IF(ISBLANK('Liste classe'!G27),\" \",('Liste classe'!G27))","v":" "},null,""]
["Circuit 6",{"$f":"IF(ISBLANK(Circuits!AZ8),\" \",(Circuits!AZ8))","v":" "},{"$f":"IF(ISBLANK(Circuits!BA8),\" \",(Circuits!BA8))","v":" "},null,null," ",null,"SUR"," ",null,null,null,null,null,{"$f":"IF(ISBLANK('Liste classe'!H27),\" \",('Liste classe'!H27))","v":" "},null,""]
["Circuit 7",{"$f":"IF(ISBLANK(Circuits!AZ9),\" \",(Circuits!AZ9))","v":" "},{"$f":"IF(ISBLANK(Circuits!BA9),\" \",(Circuits!BA9))","v":" "},null,null," ",null,"SUR"," ",null,null,null,null,null,{"$f":"IF(ISBLANK('Liste classe'!I27),\" \",('Liste classe'!I27))","v":" "},null,""]
["Circuit 8",{"$f":"IF(ISBLANK(Circuits!AZ10),\" \",(Circuits!AZ10))","v":" "},{"$f":"IF(ISBLANK(Circuits!BA10),\" \",(Circuits!BA10))","v":" "},null,null," ",null,"SUR"," ",null,null,null,null,null,{"$f":"IF(ISBLANK('Liste classe'!J27),\" \",('Liste classe'!J27))","v":" "},null,""]
["Circuit 9",{"$f":"IF(ISBLANK(Circuits!AZ11),\" \",(Circuits!AZ11))","v":" "},{"$f":"IF(ISBLANK(Circuits!BA11),\" \",(Circuits!BA11))","v":" "},null,null," ",null,"SUR"," ",null,null,null,null,null,null,null,""]
["Circuit 10",{"$f":"IF(ISBLANK(Circuits!AZ12),\" \",(Circuits!AZ12))","v":" "},{"$f":"IF(ISBLANK(Circuits!BA12),\" \",(Circuits!BA12))","v":" "},null,null," ",null,"SUR"," ",null,null,null,null,null,null,null,""]
["Circuit 11",{"$f":"IF(ISBLANK(Circuits!AZ13),\" \",(Circuits!AZ13))","v":" "},{"$f":"IF(ISBLANK(Circuits!BA13),\" \",(Circuits!BA13))","v":" "},null,null," ",null,"SUR"," ",null,null,null,null,null,null,null,""]
["Circuit 12",{"$f":"IF(ISBLANK(Circuits!AZ14),\" \",(Circuits!AZ14))","v":" "},{"$f":"IF(ISBLANK(Circuits!BA14),\" \",(Circuits!BA14))","v":" "},null,null," ",null,"SUR"," ",null,null,null,null,null,null,null,""]
["Circuit 13",{"$f":"IF(ISBLANK(Circuits!AZ15),\" \",(Circuits!AZ15))","v":" "},{"$f":"IF(ISBLANK(Circuits!BA15),\" \",(Circuits!BA15))","v":" "},null,null," ",null,"SUR"," ",null,null,null,null,null,null,null,""]
["Circuit 14",{"$f":"IF(ISBLANK(Circuits!AZ16),\" \",(Circuits!AZ16))","v":" "},{"$f":"IF(ISBLANK(Circuits!BA16),\" \",(Circuits!BA16))","v":" "},null,null," ",null,"SUR"," ",null,null,null,null,null,null,null,""]
["Circuit 15",{"$f":"IF(ISBLANK(Circuits!AZ17),\" \",(Circuits!AZ17))","v":" "},{"$f":"IF(ISBLANK(Circuits!BA17),\" \",(Circuits!BA17))","v":" "},null,null," ",null,"SUR"," ",null,null,null,null,null,null,null,""]
["Circuit 16",{"$f":"IF(ISBLANK(Circuits!AZ18),\" \",(Circuits!AZ18))","v":" "},{"$f":"IF(ISBLANK(Circuits!BA18),\" \",(Circuits!BA18))","v":" "},null,null," ",null,"SUR"," ",null,null,null,null,null,null,null,""]
["Circuit 17",{"$f":"IF(ISBLANK(Circuits!AZ19),\" \",(Circuits!AZ19))","v":" "},{"$f":"IF(ISBLANK(Circuits!BA19),\" \",(Circuits!BA19))","v":" "},null,null," ",null,"SUR"," ",null,null,null,null,null,null,null,""]
["Circuit 18",{"$f":"IF(ISBLANK(Circuits!AZ20),\" \",(Circuits!AZ20))","v":" "},{"$f":"IF(ISBLANK(Circuits!BA20),\" \",(Circuits!BA20))","v":" "},null,null," ",null,"SUR"," ",null,null,null,null,null,null,null,""]
["Circuit 19",{"$f":"IF(ISBLANK(Circuits!AZ21),\" \",(Circuits!AZ21))","v":" "},{"$f":"IF(ISBLANK(Circuits!BA21),\" \",(Circuits!BA21))","v":" "},null,null," ",null,"SUR"," ",null,null,null,null,null,null,null,""]
["Circuit 20",{"$f":"IF(ISBLANK(Circuits!AZ22),\" \",(Circuits!AZ22))","v":" "},{"$f":"IF(ISBLANK(Circuits!BA22),\" \",(Circuits!BA22))","v":" "},null,null," ",null,"SUR"," ",null,null,null,null,null,null,null,""]
[null,null,null,null,null,null,null,null,null,null,null,null,null,null,null,null,{"$f":"CONCATENATE(Q3,Q4,Q5,Q6,Q7,Q8,Q9,Q10,Q11,Q12,Q13,Q14,Q15,Q16,Q17,Q18,Q19,Q20,Q21,Q22)","v":""}]
[null,null,null,"TEMPS TOTAL",null,{"$f":"SUM(F3:F22)","v":"00:00:00"}]
[]
[null,null,null,"TEMPS MOYEN",null,{"$f":"IF(ISBLANK(D3),\" \",AVERAGE(F3:F22))","v":" "}]
[]
[null,null,null,"NB TOTAL BALISES",null,null,{"$f":"SUM(G3:G22)","v":0},"SUR",{"$f":"SUM(I3:I22)","v":0}]
[]
[null,null,null,{"$f":"COUNTA(D3:D22)","v":0},{"$f":"COUNTA(E3:E22)","v":0}]

{"sheet":"E26","index":30,"n_rows":30,"n_cols":17,"rows_kept":30,"cut":false,"hidden":false,"merged":[]}
[null,null,null,"EQUIPE ",26,null," ",null," ",{"$f":"NOW()","v":43688.614419444442}]
[null,"BALISES","NB","DEPART","ARRIVEE","TEMPS","NB Trouvées"]
["Circuit 1",{"$f":"IF(ISBLANK(Circuits!BB3),\" \",(Circuits!BB3))","v":" "},{"$f":"IF(ISBLANK(Circuits!BC3),\" \",(Circuits!BC3))","v":" "},null,null,{"$f":"IF(ISBLANK(E3),\" \",E3-D3)","v":" "},null,"SUR",{"$f":"IF(ISBLANK(D3),\" \",C3)","v":" "},null,null,null,null,null,null,null,{"$f":"IF(COUNTA(D3)=COUNTA(E3),\"\",B3)","v":""}]
["Circuit 2",{"$f":"IF(ISBLANK(Circuits!BB4),\" \",(Circuits!BB4))","v":" "},{"$f":"IF(ISBLANK(Circuits!BC4),\" \",(Circuits!BC4))","v":" "},null,null," ",null,"SUR",{"$f":"IF(ISBLANK(D4),\" \",C4)","v":" "},null,null,null,null,null,null,null,{"$f":"IF(COUNTA(D4)=COUNTA(E4),\"\",B4)","v":""}]
["Circuit 3",{"$f":"IF(ISBLANK(Circuits!BB5),\" \",(Circuits!BB5))","v":" "},{"$f":"IF(ISBLANK(Circuits!BC5),\" \",(Circuits!BC5))","v":" "},null,null," ",null,"SUR"," ",null,null,null,null,null,{"$f":"IF(ISBLANK('Liste classe'!E28),\" \",('Liste classe'!E28))","v":" "},null,""]
["Circuit 4",{"$f":"IF(ISBLANK(Circuits!BB6),\" \",(Circuits!BB6))","v":" "},{"$f":"IF(ISBLANK(Circuits!BC6),\" \",(Circuits!BC6))","v":" "},null,null," ",null,"SUR"," ",null,null,null,null,null,{"$f":"IF(ISBLANK('Liste classe'!F28),\" \",('Liste classe'!F28))","v":" "},null,""]
["Circuit 5",{"$f":"IF(ISBLANK(Circuits!BB7),\" \",(Circuits!BB7))","v":" "},{"$f":"IF(ISBLANK(Circuits!BC7),\" \",(Circuits!BC7))","v":" "},null,null," ",null,"SUR"," ",null,null,null,null,null,{"$f":"IF(ISBLANK('Liste classe'!G28),\" \",('Liste classe'!G28))","v":" "},null,""]
["Circuit 6",{"$f":"IF(ISBLANK(Circuits!BB8),\" \",(Circuits!BB8))","v":" "},{"$f":"IF(ISBLANK(Circuits!BC8),\" \",(Circuits!BC8))","v":" "},null,null," ",null,"SUR"," ",null,null,null,null,null,{"$f":"IF(ISBLANK('Liste classe'!H28),\" \",('Liste classe'!H28))","v":" "},null,""]
["Circuit 7",{"$f":"IF(ISBLANK(Circuits!BB9),\" \",(Circuits!BB9))","v":" "},{"$f":"IF(ISBLANK(Circuits!BC9),\" \",(Circuits!BC9))","v":" "},null,null," ",null,"SUR"," ",null,null,null,null,null,{"$f":"IF(ISBLANK('Liste classe'!I28),\" \",('Liste classe'!I28))","v":" "},null,""]
["Circuit 8",{"$f":"IF(ISBLANK(Circuits!BB10),\" \",(Circuits!BB10))","v":" "},{"$f":"IF(ISBLANK(Circuits!BC10),\" \",(Circuits!BC10))","v":" "},null,null," ",null,"SUR"," ",null,null,null,null,null,{"$f":"IF(ISBLANK('Liste classe'!J28),\" \",('Liste classe'!J28))","v":" "},null,""]
["Circuit 9",{"$f":"IF(ISBLANK(Circuits!BB11),\" \",(Circuits!BB11))","v":" "},{"$f":"IF(ISBLANK(Circuits!BC11),\" \",(Circuits!BC11))","v":" "},null,null," ",null,"SUR"," ",null,null,null,null,null,null,null,""]
["Circuit 10",{"$f":"IF(ISBLANK(Circuits!BB12),\" \",(Circuits!BB12))","v":" "},{"$f":"IF(ISBLANK(Circuits!BC12),\" \",(Circuits!BC12))","v":" "},null,null," ",null,"SUR"," ",null,null,null,null,null,null,null,""]
["Circuit 11",{"$f":"IF(ISBLANK(Circuits!BB13),\" \",(Circuits!BB13))","v":" "},{"$f":"IF(ISBLANK(Circuits!BC13),\" \",(Circuits!BC13))","v":" "},null,null," ",null,"SUR"," ",null,null,null,null,null,null,null,""]
["Circuit 12",{"$f":"IF(ISBLANK(Circuits!BB14),\" \",(Circuits!BB14))","v":" "},{"$f":"IF(ISBLANK(Circuits!BC14),\" \",(Circuits!BC14))","v":" "},null,null," ",null,"SUR"," ",null,null,null,null,null,null,null,""]
["Circuit 13",{"$f":"IF(ISBLANK(Circuits!BB15),\" \",(Circuits!BB15))","v":" "},{"$f":"IF(ISBLANK(Circuits!BC15),\" \",(Circuits!BC15))","v":" "},null,null," ",null,"SUR"," ",null,null,null,null,null,null,null,""]
["Circuit 14",{"$f":"IF(ISBLANK(Circuits!BB16),\" \",(Circuits!BB16))","v":" "},{"$f":"IF(ISBLANK(Circuits!BC16),\" \",(Circuits!BC16))","v":" "},null,null," ",null,"SUR"," ",null,null,null,null,null,null,null,""]
["Circuit 15",{"$f":"IF(ISBLANK(Circuits!BB17),\" \",(Circuits!BB17))","v":" "},{"$f":"IF(ISBLANK(Circuits!BC17),\" \",(Circuits!BC17))","v":" "},null,null," ",null,"SUR"," ",null,null,null,null,null,null,null,""]
["Circuit 16",{"$f":"IF(ISBLANK(Circuits!BB18),\" \",(Circuits!BB18))","v":" "},{"$f":"IF(ISBLANK(Circuits!BC18),\" \",(Circuits!BC18))","v":" "},null,null," ",null,"SUR"," ",null,null,null,null,null,null,null,""]
["Circuit 17",{"$f":"IF(ISBLANK(Circuits!BB19),\" \",(Circuits!BB19))","v":" "},{"$f":"IF(ISBLANK(Circuits!BC19),\" \",(Circuits!BC19))","v":" "},null,null," ",null,"SUR"," ",null,null,null,null,null,null,null,""]
["Circuit 18",{"$f":"IF(ISBLANK(Circuits!BB20),\" \",(Circuits!BB20))","v":" "},{"$f":"IF(ISBLANK(Circuits!BC20),\" \",(Circuits!BC20))","v":" "},null,null," ",null,"SUR"," ",null,null,null,null,null,null,null,""]
["Circuit 19",{"$f":"IF(ISBLANK(Circuits!BB21),\" \",(Circuits!BB21))","v":" "},{"$f":"IF(ISBLANK(Circuits!BC21),\" \",(Circuits!BC21))","v":" "},null,null," ",null,"SUR"," ",null,null,null,null,null,null,null,""]
["Circuit 20",{"$f":"IF(ISBLANK(Circuits!BB22),\" \",(Circuits!BB22))","v":" "},{"$f":"IF(ISBLANK(Circuits!BC22),\" \",(Circuits!BC22))","v":" "},null,null," ",null,"SUR"," ",null,null,null,null,null,null,null,""]
[null,null,null,null,null,null,null,null,null,null,null,null,null,null,null,null,{"$f":"CONCATENATE(Q3,Q4,Q5,Q6,Q7,Q8,Q9,Q10,Q11,Q12,Q13,Q14,Q15,Q16,Q17,Q18,Q19,Q20,Q21,Q22)","v":""}]
[null,null,null,"TEMPS TOTAL",null,{"$f":"SUM(F3:F22)","v":"00:00:00"}]
[]
[null,null,null,"TEMPS MOYEN",null,{"$f":"IF(ISBLANK(D3),\" \",AVERAGE(F3:F22))","v":" "}]
[]
[null,null,null,"NB TOTAL BALISES",null,null,{"$f":"SUM(G3:G22)","v":0},"SUR",{"$f":"SUM(I3:I22)","v":0}]
[]
[null,null,null,{"$f":"COUNTA(D3:D22)","v":0},{"$f":"COUNTA(E3:E22)","v":0}]

{"sheet":"E27","index":31,"n_rows":30,"n_cols":17,"rows_kept":30,"cut":false,"hidden":false,"merged":[]}
[null,null,null,"EQUIPE ",27,null," ",null," ",{"$f":"NOW()","v":43688.614419444442}]
[null,"BALISES","NB","DEPART","ARRIVEE","TEMPS","NB Trouvées"]
["Circuit 1",{"$f":"IF(ISBLANK(Circuits!BD3),\" \",(Circuits!BD3))","v":" "},{"$f":"IF(ISBLANK(Circuits!BE3),\" \",(Circuits!BE3))","v":" "},null,null,{"$f":"IF(ISBLANK(E3),\" \",E3-D3)","v":" "},null,"SUR",{"$f":"IF(ISBLANK(D3),\" \",C3)","v":" "},null,null,null,null,null,null,null,{"$f":"IF(COUNTA(D3)=COUNTA(E3),\"\",B3)","v":""}]
["Circuit 2",{"$f":"IF(ISBLANK(Circuits!BD4),\" \",(Circuits!BD4))","v":" "},{"$f":"IF(ISBLANK(Circuits!BE4),\" \",(Circuits!BE4))","v":" "},null,null," ",null,"SUR",{"$f":"IF(ISBLANK(D4),\" \",C4)","v":" "},null,null,null,null,null,null,null,{"$f":"IF(COUNTA(D4)=COUNTA(E4),\"\",B4)","v":""}]
["Circuit 3",{"$f":"IF(ISBLANK(Circuits!BD5),\" \",(Circuits!BD5))","v":" "},{"$f":"IF(ISBLANK(Circuits!BE5),\" \",(Circuits!BE5))","v":" "},null,null," ",null,"SUR"," ",null,null,null,null,null,{"$f":"IF(ISBLANK('Liste classe'!E29),\" \",('Liste classe'!E29))","v":" "},null,""]
["Circuit 4",{"$f":"IF(ISBLANK(Circuits!BD6),\" \",(Circuits!BD6))","v":" "},{"$f":"IF(ISBLANK(Circuits!BE6),\" \",(Circuits!BE6))","v":" "},null,null," ",null,"SUR"," ",null,null,null,null,null,{"$f":"IF(ISBLANK('Liste classe'!F29),\" \",('Liste classe'!F29))","v":" "},null,""]
["Circuit 5",{"$f":"IF(ISBLANK(Circuits!BD7),\" \",(Circuits!BD7))","v":" "},{"$f":"IF(ISBLANK(Circuits!BE7),\" \",(Circuits!BE7))","v":" "},null,null," ",null,"SUR"," ",null,null,null,null,null,{"$f":"IF(ISBLANK('Liste classe'!G29),\" \",('Liste classe'!G29))","v":" "},null,""]
["Circuit 6",{"$f":"IF(ISBLANK(Circuits!BD8),\" \",(Circuits!BD8))","v":" "},{"$f":"IF(ISBLANK(Circuits!BE8),\" \",(Circuits!BE8))","v":" "},null,null," ",null,"SUR"," ",null,null,null,null,null,{"$f":"IF(ISBLANK('Liste classe'!H29),\" \",('Liste classe'!H29))","v":" "},null,""]
["Circuit 7",{"$f":"IF(ISBLANK(Circuits!BD9),\" \",(Circuits!BD9))","v":" "},{"$f":"IF(ISBLANK(Circuits!BE9),\" \",(Circuits!BE9))","v":" "},null,null," ",null,"SUR"," ",null,null,null,null,null,{"$f":"IF(ISBLANK('Liste classe'!I29),\" \",('Liste classe'!I29))","v":" "},null,""]
["Circuit 8",{"$f":"IF(ISBLANK(Circuits!BD10),\" \",(Circuits!BD10))","v":" "},{"$f":"IF(ISBLANK(Circuits!BE10),\" \",(Circuits!BE10))","v":" "},null,null," ",null,"SUR"," ",null,null,null,null,null,{"$f":"IF(ISBLANK('Liste classe'!J29),\" \",('Liste classe'!J29))","v":" "},null,""]
["Circuit 9",{"$f":"IF(ISBLANK(Circuits!BD11),\" \",(Circuits!BD11))","v":" "},{"$f":"IF(ISBLANK(Circuits!BE11),\" \",(Circuits!BE11))","v":" "},null,null," ",null,"SUR"," ",null,null,null,null,null,null,null,""]
["Circuit 10",{"$f":"IF(ISBLANK(Circuits!BD12),\" \",(Circuits!BD12))","v":" "},{"$f":"IF(ISBLANK(Circuits!BE12),\" \",(Circuits!BE12))","v":" "},null,null," ",null,"SUR"," ",null,null,null,null,null,null,null,""]
["Circuit 11",{"$f":"IF(ISBLANK(Circuits!BD13),\" \",(Circuits!BD13))","v":" "},{"$f":"IF(ISBLANK(Circuits!BE13),\" \",(Circuits!BE13))","v":" "},null,null," ",null,"SUR"," ",null,null,null,null,null,null,null,""]
["Circuit 12",{"$f":"IF(ISBLANK(Circuits!BD14),\" \",(Circuits!BD14))","v":" "},{"$f":"IF(ISBLANK(Circuits!BE14),\" \",(Circuits!BE14))","v":" "},null,null," ",null,"SUR"," ",null,null,null,null,null,null,null,""]
["Circuit 13",{"$f":"IF(ISBLANK(Circuits!BD15),\" \",(Circuits!BD15))","v":" "},{"$f":"IF(ISBLANK(Circuits!BE15),\" \",(Circuits!BE15))","v":" "},null,null," ",null,"SUR"," ",null,null,null,null,null,null,null,""]
["Circuit 14",{"$f":"IF(ISBLANK(Circuits!BD16),\" \",(Circuits!BD16))","v":" "},{"$f":"IF(ISBLANK(Circuits!BE16),\" \",(Circuits!BE16))","v":" "},null,null," ",null,"SUR"," ",null,null,null,null,null,null,null,""]
["Circuit 15",{"$f":"IF(ISBLANK(Circuits!BD17),\" \",(Circuits!BD17))","v":" "},{"$f":"IF(ISBLANK(Circuits!BE17),\" \",(Circuits!BE17))","v":" "},null,null," ",null,"SUR"," ",null,null,null,null,null,null,null,""]
["Circuit 16",{"$f":"IF(ISBLANK(Circuits!BD18),\" \",(Circuits!BD18))","v":" "},{"$f":"IF(ISBLANK(Circuits!BE18),\" \",(Circuits!BE18))","v":" "},null,null," ",null,"SUR"," ",null,null,null,null,null,null,null,""]
["Circuit 17",{"$f":"IF(ISBLANK(Circuits!BD19),\" \",(Circuits!BD19))","v":" "},{"$f":"IF(ISBLANK(Circuits!BE19),\" \",(Circuits!BE19))","v":" "},null,null," ",null,"SUR"," ",null,null,null,null,null,null,null,""]
["Circuit 18",{"$f":"IF(ISBLANK(Circuits!BD20),\" \",(Circuits!BD20))","v":" "},{"$f":"IF(ISBLANK(Circuits!BE20),\" \",(Circuits!BE20))","v":" "},null,null," ",null,"SUR"," ",null,null,null,null,null,null,null,""]
["Circuit 19",{"$f":"IF(ISBLANK(Circuits!BD21),\" \",(Circuits!BD21))","v":" "},{"$f":"IF(ISBLANK(Circuits!BE21),\" \",(Circuits!BE21))","v":" "},null,null," ",null,"SUR"," ",null,null,null,null,null,null,null,""]
["Circuit 20",{"$f":"IF(ISBLANK(Circuits!BD22),\" \",(Circuits!BD22))","v":" "},{"$f":"IF(ISBLANK(Circuits!BE22),\" \",(Circuits!BE22))","v":" "},null,null," ",null,"SUR"," ",null,null,null,null,null,null,null,""]
[null,null,null,null,null,null,null,null,null,null,null,null,null,null,null,null,{"$f":"CONCATENATE(Q3,Q4,Q5,Q6,Q7,Q8,Q9,Q10,Q11,Q12,Q13,Q14,Q15,Q16,Q17,Q18,Q19,Q20,Q21,Q22)","v":""}]
[null,null,null,"TEMPS TOTAL",null,{"$f":"SUM(F3:F22)","v":"00:00:00"}]
[]
[null,null,null,"TEMPS MOYEN",null,{"$f":"IF(ISBLANK(D3),\" \",AVERAGE(F3:F22))","v":" "}]
[]
[null,null,null,"NB TOTAL BALISES",null,null,{"$f":"SUM(G3:G22)","v":0},"SUR",{"$f":"SUM(I3:I22)","v":0}]
[]
[null,null,null,{"$f":"COUNTA(D3:D22)","v":0},{"$f":"COUNTA(E3:E22)","v":0}]

{"sheet":"E28","index":32,"n_rows":30,"n_cols":17,"rows_kept":30,"cut":false,"hidden":false,"merged":[]}
[null,null,null,"EQUIPE ",28,null," ",null," ",{"$f":"NOW()","v":43688.614419444442}]
[null,"BALISES","NB","DEPART","ARRIVEE","TEMPS","NB Trouvées"]
["Circuit 1",{"$f":"IF(ISBLANK(Circuits!BF3),\" \",(Circuits!BF3))","v":" "},{"$f":"IF(ISBLANK(Circuits!BG3),\" \",(Circuits!BG3))","v":" "},null,null,{"$f":"IF(ISBLANK(E3),\" \",E3-D3)","v":" "},null,"SUR",{"$f":"IF(ISBLANK(D3),\" \",C3)","v":" "},null,null,null,null,null,null,null,{"$f":"IF(COUNTA(D3)=COUNTA(E3),\"\",B3)","v":""}]
["Circuit 2",{"$f":"IF(ISBLANK(Circuits!BF4),\" \",(Circuits!BF4))","v":" "},{"$f":"IF(ISBLANK(Circuits!BG4),\" \",(Circuits!BG4))","v":" "},null,null," ",null,"SUR",{"$f":"IF(ISBLANK(D4),\" \",C4)","v":" "},null,null,null,null,null,null,null,{"$f":"IF(COUNTA(D4)=COUNTA(E4),\"\",B4)","v":""}]
["Circuit 3",{"$f":"IF(ISBLANK(Circuits!BF5),\" \",(Circuits!BF5))","v":" "},{"$f":"IF(ISBLANK(Circuits!BG5),\" \",(Circuits!BG5))","v":" "},null,null," ",null,"SUR"," ",null,null,null,null,null,{"$f":"IF(ISBLANK('Liste classe'!E30),\" \",('Liste classe'!E30))","v":" "},null,""]
["Circuit 4",{"$f":"IF(ISBLANK(Circuits!BF6),\" \",(Circuits!BF6))","v":" "},{"$f":"IF(ISBLANK(Circuits!BG6),\" \",(Circuits!BG6))","v":" "},null,null," ",null,"SUR"," ",null,null,null,null,null,{"$f":"IF(ISBLANK('Liste classe'!F30),\" \",('Liste classe'!F30))","v":" "},null,""]
["Circuit 5",{"$f":"IF(ISBLANK(Circuits!BF7),\" \",(Circuits!BF7))","v":" "},{"$f":"IF(ISBLANK(Circuits!BG7),\" \",(Circuits!BG7))","v":" "},null,null," ",null,"SUR"," ",null,null,null,null,null,{"$f":"IF(ISBLANK('Liste classe'!G30),\" \",('Liste classe'!G30))","v":" "},null,""]
["Circuit 6",{"$f":"IF(ISBLANK(Circuits!BF8),\" \",(Circuits!BF8))","v":" "},{"$f":"IF(ISBLANK(Circuits!BG8),\" \",(Circuits!BG8))","v":" "},null,null," ",null,"SUR"," ",null,null,null,null,null,{"$f":"IF(ISBLANK('Liste classe'!H30),\" \",('Liste classe'!H30))","v":" "},null,""]
["Circuit 7",{"$f":"IF(ISBLANK(Circuits!BF9),\" \",(Circuits!BF9))","v":" "},{"$f":"IF(ISBLANK(Circuits!BG9),\" \",(Circuits!BG9))","v":" "},null,null," ",null,"SUR"," ",null,null,null,null,null,{"$f":"IF(ISBLANK('Liste classe'!I30),\" \",('Liste classe'!I30))","v":" "},null,""]
["Circuit 8",{"$f":"IF(ISBLANK(Circuits!BF10),\" \",(Circuits!BF10))","v":" "},{"$f":"IF(ISBLANK(Circuits!BG10),\" \",(Circuits!BG10))","v":" "},null,null," ",null,"SUR"," ",null,null,null,null,null,{"$f":"IF(ISBLANK('Liste classe'!J30),\" \",('Liste classe'!J30))","v":" "},null,""]
["Circuit 9",{"$f":"IF(ISBLANK(Circuits!BF11),\" \",(Circuits!BF11))","v":" "},{"$f":"IF(ISBLANK(Circuits!BG11),\" \",(Circuits!BG11))","v":" "},null,null," ",null,"SUR"," ",null,null,null,null,null,null,null,""]
["Circuit 10",{"$f":"IF(ISBLANK(Circuits!BF12),\" \",(Circuits!BF12))","v":" "},{"$f":"IF(ISBLANK(Circuits!BG12),\" \",(Circuits!BG12))","v":" "},null,null," ",null,"SUR"," ",null,null,null,null,null,null,null,""]
["Circuit 11",{"$f":"IF(ISBLANK(Circuits!BF13),\" \",(Circuits!BF13))","v":" "},{"$f":"IF(ISBLANK(Circuits!BG13),\" \",(Circuits!BG13))","v":" "},null,null," ",null,"SUR"," ",null,null,null,null,null,null,null,""]
["Circuit 12",{"$f":"IF(ISBLANK(Circuits!BF14),\" \",(Circuits!BF14))","v":" "},{"$f":"IF(ISBLANK(Circuits!BG14),\" \",(Circuits!BG14))","v":" "},null,null," ",null,"SUR"," ",null,null,null,null,null,null,null,""]
["Circuit 13",{"$f":"IF(ISBLANK(Circuits!BF15),\" \",(Circuits!BF15))","v":" "},{"$f":"IF(ISBLANK(Circuits!BG15),\" \",(Circuits!BG15))","v":" "},null,null," ",null,"SUR"," ",null,null,null,null,null,null,null,""]
["Circuit 14",{"$f":"IF(ISBLANK(Circuits!BF16),\" \",(Circuits!BF16))","v":" "},{"$f":"IF(ISBLANK(Circuits!BG16),\" \",(Circuits!BG16))","v":" "},null,null," ",null,"SUR"," ",null,null,null,null,null,null,null,""]
["Circuit 15",{"$f":"IF(ISBLANK(Circuits!BF17),\" \",(Circuits!BF17))","v":" "},{"$f":"IF(ISBLANK(Circuits!BG17),\" \",(Circuits!BG17))","v":" "},null,null," ",null,"SUR"," ",null,null,null,null,null,null,null,""]
["Circuit 16",{"$f":"IF(ISBLANK(Circuits!BF18),\" \",(Circuits!BF18))","v":" "},{"$f":"IF(ISBLANK(Circuits!BG18),\" \",(Circuits!BG18))","v":" "},null,null," ",null,"SUR"," ",null,null,null,null,null,null,null,""]
["Circuit 17",{"$f":"IF(ISBLANK(Circuits!BF19),\" \",(Circuits!BF19))","v":" "},{"$f":"IF(ISBLANK(Circuits!BG19),\" \",(Circuits!BG19))","v":" "},null,null," ",null,"SUR"," ",null,null,null,null,null,null,null,""]
["Circuit 18",{"$f":"IF(ISBLANK(Circuits!BF20),\" \",(Circuits!BF20))","v":" "},{"$f":"IF(ISBLANK(Circuits!BG20),\" \",(Circuits!BG20))","v":" "},null,null," ",null,"SUR"," ",null,null,null,null,null,null,null,""]
["Circuit 19",{"$f":"IF(ISBLANK(Circuits!BF21),\" \",(Circuits!BF21))","v":" "},{"$f":"IF(ISBLANK(Circuits!BG21),\" \",(Circuits!BG21))","v":" "},null,null," ",null,"SUR"," ",null,null,null,null,null,null,null,""]
["Circuit 20",{"$f":"IF(ISBLANK(Circuits!BF22),\" \",(Circuits!BF22))","v":" "},{"$f":"IF(ISBLANK(Circuits!BG22),\" \",(Circuits!BG22))","v":" "},null,null," ",null,"SUR"," ",null,null,null,null,null,null,null,""]
[null,null,null,null,null,null,null,null,null,null,null,null,null,null,null,null,{"$f":"CONCATENATE(Q3,Q4,Q5,Q6,Q7,Q8,Q9,Q10,Q11,Q12,Q13,Q14,Q15,Q16,Q17,Q18,Q19,Q20,Q21,Q22)","v":""}]
[null,null,null,"TEMPS TOTAL",null,{"$f":"SUM(F3:F22)","v":"00:00:00"}]
[]
[null,null,null,"TEMPS MOYEN",null,{"$f":"IF(ISBLANK(D3),\" \",AVERAGE(F3:F22))","v":" "}]
[]
[null,null,null,"NB TOTAL BALISES",null,null,{"$f":"SUM(G3:G22)","v":0},"SUR",{"$f":"SUM(I3:I22)","v":0}]
[]
[null,null,null,{"$f":"COUNTA(D3:D22)","v":0},{"$f":"COUNTA(E3:E22)","v":0}]

{"sheet":"E29","index":33,"n_rows":30,"n_cols":17,"rows_kept":30,"cut":false,"hidden":false,"merged":[]}
[null,null,null,"EQUIPE ",29,null," ",null," ",{"$f":"NOW()","v":43688.614419444442}]
[null,"BALISES","NB","DEPART","ARRIVEE","TEMPS","NB Trouvées"]
["Circuit 1",{"$f":"IF(ISBLANK(Circuits!BH3),\" \",(Circuits!BH3))","v":" "},{"$f":"IF(ISBLANK(Circuits!BI3),\" \",(Circuits!BI3))","v":" "},null,null,{"$f":"IF(ISBLANK(E3),\" \",E3-D3)","v":" "},null,"SUR",{"$f":"IF(ISBLANK(D3),\" \",C3)","v":" "},null,null,null,null,null,null,null,{"$f":"IF(COUNTA(D3)=COUNTA(E3),\"\",B3)","v":""}]
["Circuit 2",{"$f":"IF(ISBLANK(Circuits!BH4),\" \",(Circuits!BH4))","v":" "},{"$f":"IF(ISBLANK(Circuits!BI4),\" \",(Circuits!BI4))","v":" "},null,null," ",null,"SUR",{"$f":"IF(ISBLANK(D4),\" \",C4)","v":" "},null,null,null,null,null,null,null,{"$f":"IF(COUNTA(D4)=COUNTA(E4),\"\",B4)","v":""}]
["Circuit 3",{"$f":"IF(ISBLANK(Circuits!BH5),\" \",(Circuits!BH5))","v":" "},{"$f":"IF(ISBLANK(Circuits!BI5),\" \",(Circuits!BI5))","v":" "},null,null," ",null,"SUR"," ",null,null,null,null,null,{"$f":"IF(ISBLANK('Liste classe'!E31),\" \",('Liste classe'!E31))","v":" "},null,""]
["Circuit 4",{"$f":"IF(ISBLANK(Circuits!BH6),\" \",(Circuits!BH6))","v":" "},{"$f":"IF(ISBLANK(Circuits!BI6),\" \",(Circuits!BI6))","v":" "},null,null," ",null,"SUR"," ",null,null,null,null,null,{"$f":"IF(ISBLANK('Liste classe'!F31),\" \",('Liste classe'!F31))","v":" "},null,""]
["Circuit 5",{"$f":"IF(ISBLANK(Circuits!BH7),\" \",(Circuits!BH7))","v":" "},{"$f":"IF(ISBLANK(Circuits!BI7),\" \",(Circuits!BI7))","v":" "},null,null," ",null,"SUR"," ",null,null,null,null,null,{"$f":"IF(ISBLANK('Liste classe'!G31),\" \",('Liste classe'!G31))","v":" "},null,""]
["Circuit 6",{"$f":"IF(ISBLANK(Circuits!BH8),\" \",(Circuits!BH8))","v":" "},{"$f":"IF(ISBLANK(Circuits!BI8),\" \",(Circuits!BI8))","v":" "},null,null," ",null,"SUR"," ",null,null,null,null,null,{"$f":"IF(ISBLANK('Liste classe'!H31),\" \",('Liste classe'!H31))","v":" "},null,""]
["Circuit 7",{"$f":"IF(ISBLANK(Circuits!BH9),\" \",(Circuits!BH9))","v":" "},{"$f":"IF(ISBLANK(Circuits!BI9),\" \",(Circuits!BI9))","v":" "},null,null," ",null,"SUR"," ",null,null,null,null,null,{"$f":"IF(ISBLANK('Liste classe'!I31),\" \",('Liste classe'!I31))","v":" "},null,""]
["Circuit 8",{"$f":"IF(ISBLANK(Circuits!BH10),\" \",(Circuits!BH10))","v":" "},{"$f":"IF(ISBLANK(Circuits!BI10),\" \",(Circuits!BI10))","v":" "},null,null," ",null,"SUR"," ",null,null,null,null,null,{"$f":"IF(ISBLANK('Liste classe'!J31),\" \",('Liste classe'!J31))","v":" "},null,""]
["Circuit 9",{"$f":"IF(ISBLANK(Circuits!BH11),\" \",(Circuits!BH11))","v":" "},{"$f":"IF(ISBLANK(Circuits!BI11),\" \",(Circuits!BI11))","v":" "},null,null," ",null,"SUR"," ",null,null,null,null,null,null,null,""]
["Circuit 10",{"$f":"IF(ISBLANK(Circuits!BH12),\" \",(Circuits!BH12))","v":" "},{"$f":"IF(ISBLANK(Circuits!BI12),\" \",(Circuits!BI12))","v":" "},null,null," ",null,"SUR"," ",null,null,null,null,null,null,null,""]
["Circuit 11",{"$f":"IF(ISBLANK(Circuits!BH13),\" \",(Circuits!BH13))","v":" "},{"$f":"IF(ISBLANK(Circuits!BI13),\" \",(Circuits!BI13))","v":" "},null,null," ",null,"SUR"," ",null,null,null,null,null,null,null,""]
["Circuit 12",{"$f":"IF(ISBLANK(Circuits!BH14),\" \",(Circuits!BH14))","v":" "},{"$f":"IF(ISBLANK(Circuits!BI14),\" \",(Circuits!BI14))","v":" "},null,null," ",null,"SUR"," ",null,null,null,null,null,null,null,""]
["Circuit 13",{"$f":"IF(ISBLANK(Circuits!BH15),\" \",(Circuits!BH15))","v":" "},{"$f":"IF(ISBLANK(Circuits!BI15),\" \",(Circuits!BI15))","v":" "},null,null," ",null,"SUR"," ",null,null,null,null,null,null,null,""]
["Circuit 14",{"$f":"IF(ISBLANK(Circuits!BH16),\" \",(Circuits!BH16))","v":" "},{"$f":"IF(ISBLANK(Circuits!BI16),\" \",(Circuits!BI16))","v":" "},null,null," ",null,"SUR"," ",null,null,null,null,null,null,null,""]
["Circuit 15",{"$f":"IF(ISBLANK(Circuits!BH17),\" \",(Circuits!BH17))","v":" "},{"$f":"IF(ISBLANK(Circuits!BI17),\" \",(Circuits!BI17))","v":" "},null,null," ",null,"SUR"," ",null,null,null,null,null,null,null,""]
["Circuit 16",{"$f":"IF(ISBLANK(Circuits!BH18),\" \",(Circuits!BH18))","v":" "},{"$f":"IF(ISBLANK(Circuits!BI18),\" \",(Circuits!BI18))","v":" "},null,null," ",null,"SUR"," ",null,null,null,null,null,null,null,""]
["Circuit 17",{"$f":"IF(ISBLANK(Circuits!BH19),\" \",(Circuits!BH19))","v":" "},{"$f":"IF(ISBLANK(Circuits!BI19),\" \",(Circuits!BI19))","v":" "},null,null," ",null,"SUR"," ",null,null,null,null,null,null,null,""]
["Circuit 18",{"$f":"IF(ISBLANK(Circuits!BH20),\" \",(Circuits!BH20))","v":" "},{"$f":"IF(ISBLANK(Circuits!BI20),\" \",(Circuits!BI20))","v":" "},null,null," ",null,"SUR"," ",null,null,null,null,null,null,null,""]
["Circuit 19",{"$f":"IF(ISBLANK(Circuits!BH21),\" \",(Circuits!BH21))","v":" "},{"$f":"IF(ISBLANK(Circuits!BI21),\" \",(Circuits!BI21))","v":" "},null,null," ",null,"SUR"," ",null,null,null,null,null,null,null,""]
["Circuit 20",{"$f":"IF(ISBLANK(Circuits!BH22),\" \",(Circuits!BH22))","v":" "},{"$f":"IF(ISBLANK(Circuits!BI22),\" \",(Circuits!BI22))","v":" "},null,null," ",null,"SUR"," ",null,null,null,null,null,null,null,""]
[null,null,null,null,null,null,null,null,null,null,null,null,null,null,null,null,{"$f":"CONCATENATE(Q3,Q4,Q5,Q6,Q7,Q8,Q9,Q10,Q11,Q12,Q13,Q14,Q15,Q16,Q17,Q18,Q19,Q20,Q21,Q22)","v":""}]
[null,null,null,"TEMPS TOTAL",null,{"$f":"SUM(F3:F22)","v":"00:00:00"}]
[]
[null,null,null,"TEMPS MOYEN",null,{"$f":"IF(ISBLANK(D3),\" \",AVERAGE(F3:F22))","v":" "}]
[]
[null,null,null,"NB TOTAL BALISES",null,null,{"$f":"SUM(G3:G22)","v":0},"SUR",{"$f":"SUM(I3:I22)","v":0}]
[]
[null,null,null,{"$f":"COUNTA(D3:D22)","v":0},{"$f":"COUNTA(E3:E22)","v":0}]

{"sheet":"E30","index":34,"n_rows":30,"n_cols":17,"rows_kept":30,"cut":false,"hidden":false,"merged":[]}
[null,null,null,"EQUIPE ",30,null," ",null," ",{"$f":"NOW()","v":43688.614419444442}]
[null,"BALISES","NB","DEPART","ARRIVEE","TEMPS","NB Trouvées"]
["Circuit 1",{"$f":"IF(ISBLANK(Circuits!BJ3),\" \",(Circuits!BJ3))","v":" "},{"$f":"IF(ISBLANK(Circuits!BK3),\" \",(Circuits!BK3))","v":" "},null,null,{"$f":"IF(ISBLANK(E3),\" \",E3-D3)","v":" "},null,"SUR",{"$f":"IF(ISBLANK(D3),\" \",C3)","v":" "},null,null,null,null,null,null,null,{"$f":"IF(COUNTA(D3)=COUNTA(E3),\"\",B3)","v":""}]
["Circuit 2",{"$f":"IF(ISBLANK(Circuits!BJ4),\" \",(Circuits!BJ4))","v":" "},{"$f":"IF(ISBLANK(Circuits!BK4),\" \",(Circuits!BK4))","v":" "},null,null," ",null,"SUR",{"$f":"IF(ISBLANK(D4),\" \",C4)","v":" "},null,null,null,null,null,null,null,{"$f":"IF(COUNTA(D4)=COUNTA(E4),\"\",B4)","v":""}]
["Circuit 3",{"$f":"IF(ISBLANK(Circuits!BJ5),\" \",(Circuits!BJ5))","v":" "},{"$f":"IF(ISBLANK(Circuits!BK5),\" \",(Circuits!BK5))","v":" "},null,null," ",null,"SUR"," ",null,null,null,null,null,{"$f":"IF(ISBLANK('Liste classe'!E32),\" \",('Liste classe'!E32))","v":" "},null,""]
["Circuit 4",{"$f":"IF(ISBLANK(Circuits!BJ6),\" \",(Circuits!BJ6))","v":" "},{"$f":"IF(ISBLANK(Circuits!BK6),\" \",(Circuits!BK6))","v":" "},null,null," ",null,"SUR"," ",null,null,null,null,null,{"$f":"IF(ISBLANK('Liste classe'!F32),\" \",('Liste classe'!F32))","v":" "},null,""]
["Circuit 5",{"$f":"IF(ISBLANK(Circuits!BJ7),\" \",(Circuits!BJ7))","v":" "},{"$f":"IF(ISBLANK(Circuits!BK7),\" \",(Circuits!BK7))","v":" "},null,null," ",null,"SUR"," ",null,null,null,null,null,{"$f":"IF(ISBLANK('Liste classe'!G32),\" \",('Liste classe'!G32))","v":" "},null,""]
["Circuit 6",{"$f":"IF(ISBLANK(Circuits!BJ8),\" \",(Circuits!BJ8))","v":" "},{"$f":"IF(ISBLANK(Circuits!BK8),\" \",(Circuits!BK8))","v":" "},null,null," ",null,"SUR"," ",null,null,null,null,null,{"$f":"IF(ISBLANK('Liste classe'!H32),\" \",('Liste classe'!H32))","v":" "},null,""]
["Circuit 7",{"$f":"IF(ISBLANK(Circuits!BJ9),\" \",(Circuits!BJ9))","v":" "},{"$f":"IF(ISBLANK(Circuits!BK9),\" \",(Circuits!BK9))","v":" "},null,null," ",null,"SUR"," ",null,null,null,null,null,{"$f":"IF(ISBLANK('Liste classe'!I32),\" \",('Liste classe'!I32))","v":" "},null,""]
["Circuit 8",{"$f":"IF(ISBLANK(Circuits!BJ10),\" \",(Circuits!BJ10))","v":" "},{"$f":"IF(ISBLANK(Circuits!BK10),\" \",(Circuits!BK10))","v":" "},null,null," ",null,"SUR"," ",null,null,null,null,null,{"$f":"IF(ISBLANK('Liste classe'!J32),\" \",('Liste classe'!J32))","v":" "},null,""]
["Circuit 9",{"$f":"IF(ISBLANK(Circuits!BJ11),\" \",(Circuits!BJ11))","v":" "},{"$f":"IF(ISBLANK(Circuits!BK11),\" \",(Circuits!BK11))","v":" "},null,null," ",null,"SUR"," ",null,null,null,null,null,null,null,""]
["Circuit 10",{"$f":"IF(ISBLANK(Circuits!BJ12),\" \",(Circuits!BJ12))","v":" "},{"$f":"IF(ISBLANK(Circuits!BK12),\" \",(Circuits!BK12))","v":" "},null,null," ",null,"SUR"," ",null,null,null,null,null,null,null,""]
["Circuit 11",{"$f":"IF(ISBLANK(Circuits!BJ13),\" \",(Circuits!BJ13))","v":" "},{"$f":"IF(ISBLANK(Circuits!BK13),\" \",(Circuits!BK13))","v":" "},null,null," ",null,"SUR"," ",null,null,null,null,null,null,null,""]
["Circuit 12",{"$f":"IF(ISBLANK(Circuits!BJ14),\" \",(Circuits!BJ14))","v":" "},{"$f":"IF(ISBLANK(Circuits!BK14),\" \",(Circuits!BK14))","v":" "},null,null," ",null,"SUR"," ",null,null,null,null,null,null,null,""]
["Circuit 13",{"$f":"IF(ISBLANK(Circuits!BJ15),\" \",(Circuits!BJ15))","v":" "},{"$f":"IF(ISBLANK(Circuits!BK15),\" \",(Circuits!BK15))","v":" "},null,null," ",null,"SUR"," ",null,null,null,null,null,null,null,""]
["Circuit 14",{"$f":"IF(ISBLANK(Circuits!BJ16),\" \",(Circuits!BJ16))","v":" "},{"$f":"IF(ISBLANK(Circuits!BK16),\" \",(Circuits!BK16))","v":" "},null,null," ",null,"SUR"," ",null,null,null,null,null,null,null,""]
["Circuit 15",{"$f":"IF(ISBLANK(Circuits!BJ17),\" \",(Circuits!BJ17))","v":" "},{"$f":"IF(ISBLANK(Circuits!BK17),\" \",(Circuits!BK17))","v":" "},null,null," ",null,"SUR"," ",null,null,null,null,null,null,null,""]
["Circuit 16",{"$f":"IF(ISBLANK(Circuits!BJ18),\" \",(Circuits!BJ18))","v":" "},{"$f":"IF(ISBLANK(Circuits!BK18),\" \",(Circuits!BK18))","v":" "},null,null," ",null,"SUR"," ",null,null,null,null,null,null,null,""]
["Circuit 17",{"$f":"IF(ISBLANK(Circuits!BJ19),\" \",(Circuits!BJ19))","v":" "},{"$f":"IF(ISBLANK(Circuits!BK19),\" \",(Circuits!BK19))","v":" "},null,null," ",null,"SUR"," ",null,null,null,null,null,null,null,""]
["Circuit 18",{"$f":"IF(ISBLANK(Circuits!BJ20),\" \",(Circuits!BJ20))","v":" "},{"$f":"IF(ISBLANK(Circuits!BK20),\" \",(Circuits!BK20))","v":" "},null,null," ",null,"SUR"," ",null,null,null,null,null,null,null,""]
["Circuit 19",{"$f":"IF(ISBLANK(Circuits!BJ21),\" \",(Circuits!BJ21))","v":" "},{"$f":"IF(ISBLANK(Circuits!BK21),\" \",(Circuits!BK21))","v":" "},null,null," ",null,"SUR"," ",null,null,null,null,null,null,null,""]
["Circuit 20",{"$f":"IF(ISBLANK(Circuits!BJ22),\" \",(Circuits!BJ22))","v":" "},{"$f":"IF(ISBLANK(Circuits!BK22),\" \",(Circuits!BK22))","v":" "},null,null," ",null,"SUR"," ",null,null,null,null,null,null,null,""]
[null,null,null,null,null,null,null,null,null,null,null,null,null,null,null,null,{"$f":"CONCATENATE(Q3,Q4,Q5,Q6,Q7,Q8,Q9,Q10,Q11,Q12,Q13,Q14,Q15,Q16,Q17,Q18,Q19,Q20,Q21,Q22)","v":""}]
[null,null,null,"TEMPS TOTAL",null,{"$f":"SUM(F3:F22)","v":"00:00:00"}]
[]
[null,null,null,"TEMPS MOYEN",null,{"$f":"IF(ISBLANK(D3),\" \",AVERAGE(F3:F22))","v":" "}]
[]
[null,null,null,"NB TOTAL BALISES",null,null,{"$f":"SUM(G3:G22)","v":0},"SUR",{"$f":"SUM(I3:I22)","v":0}]
[]
[null,null,null,{"$f":"COUNTA(D3:D22)","v":0},{"$f":"COUNTA(E3:E22)","v":0}]

{"sheet":"Espace Prof","index":35,"n_rows":0,"n_cols":0,"rows_kept":0,"cut":false,"hidden":false,"merged":[]}